﻿"Dublin Core:Title","Dublin Core:Titre alternatif","Dublin Core:Creator","Dublin Core:Subject","Dublin Core:Description","Dublin Core:Publisher","Dublin Core:Contributor","Dublin Core:Format","Dublin Core:Extent","Dublin Core:Medium","Dublin Core:Type","Dublin Core:Identifier","Dublin Core:Source","Dublin Core:Date","Dublin Core:Language","Dublin Core:Is Part Of","Dublin Core:Has Version","Dublin Core:Coverage","Dublin Core:Provenance","Dublin Core:Rights Holder","Dublin Core:Rights","Dublin Core:Abstract","Dublin Core:Table Of Contents","Dublin Core:Date Available","Dublin Core:Relation","Dublin Core:Date Accepted","Dublin Core:Date Copyrighted","Dublin Core:Date Submitted","Dublin Core:Date Created","Dublin Core:Date Issued","Dublin Core:Date Modified","Dublin Core:Date Valid","Dublin Core:Access Rights","Dublin Core:License","Dublin Core:Conforms To","Dublin Core:Has Format","Dublin Core:Has Part","Dublin Core:Is Format Of","Dublin Core:Is Referenced By","Dublin Core:Is Replaced By","Dublin Core:Is Required By","Dublin Core:Is Version Of","Dublin Core:References","Dublin Core:Replaces","Dublin Core:Requires","Dublin Core:Bibliographic Citation","Dublin Core:Spatial Coverage","Dublin Core:Temporal Coverage","Dublin Core:Accrual Method","Dublin Core:Accrual Periodicity","Dublin Core:Accrual Policy","Dublin Core:Audience","Dublin Core:Audience Education Level","Dublin Core:Mediator","Dublin Core:Instructional Method","Item Type Metadata:Text","Item Type Metadata:Interviewer","Item Type Metadata:Interviewee","Item Type Metadata:Location","Item Type Metadata:Transcription","Item Type Metadata:Local URL","Item Type Metadata:Original Format","Item Type Metadata:Physical Dimensions","Item Type Metadata:Duration","Item Type Metadata:Compression","Item Type Metadata:Producer","Item Type Metadata:Director","Item Type Metadata:Bit Rate/Frequency","Item Type Metadata:Time Summary","Item Type Metadata:Email Body","Item Type Metadata:Subject Line","Item Type Metadata:From","Item Type Metadata:To","Item Type Metadata:CC","Item Type Metadata:BCC","Item Type Metadata:Number of Attachments","Item Type Metadata:Standards","Item Type Metadata:Objectives","Item Type Metadata:Materials","Item Type Metadata:Lesson Plan Text","Item Type Metadata:URL","Item Type Metadata:Event Type","Item Type Metadata:Participants","Item Type Metadata:Birth Date","Item Type Metadata:Birthplace","Item Type Metadata:Death Date","Item Type Metadata:Occupation","Item Type Metadata:Biographical Text","Item Type Metadata:Bibliography","Item Type Metadata:Edition Statement","Item Type Metadata:Publication Statement","Item Type Metadata:Note statement","Item Type Metadata:Profile description : Creation","Item Type Metadata:Profile description : Descriptive Rules","Item Type Metadata:Profile description : Language Usage","Item Type Metadata:Revision Description : Change","Item Type Metadata:Revision Description : List","Item Type Metadata:Front matter : Title page","Item Type Metadata:Front matter : Division","Item Type Metadata:Player","Visiteur Elements:Dites des choses","PDF Text:Text","EAD Archive:Descriptive Identification : Heading","EAD Archive:Descriptive Identification : Note","EAD Archive:Appraisal Information","EAD Archive:Arrangement","EAD Archive:Biography or History","EAD Archive:Index","EAD Archive:Level","EAD Archive:Note","EAD Archive:Other Descriptive Data","EAD Archive:Processing Information","EAD Archive:Scope and Content","EAD Archive:Heading","EAD Archive:Table Head",tags,file,itemType,collection,public,featured
"Amitiés de l'Observatoire de Meudon (titre original)",,inconnu,"Observatoire de Paris. Site de Meudon",,,"ELD (éditeur / imprimeur / commanditaire)",,,,"Reproduction photomécanique",up-cosmos-Inv.I.1912,"Bibliothèque de l'Observatoire de Paris, Inv.I.1912",s.d.,,,,,,,"Bibliothèque de l'Observatoire de Paris",,,,"Voir la notice complète dans <a href=""https://cosmos.obspm.fr/index.php/Detail/objects/33014"">Cosmos</a>",,,,,,,,,,,,,,,,,,,,,,,"19e siècle",,,,,,,,,,,,,,,,,,,,,,,,,,,,,,,,,,,,,,,,,,,,,,,,,,,,,,,,,,,,,,,,,,,,"France,Observatoire de Paris. Site de Meudon,Observatoires",https://bibnum.obspm.fr/files/original/2cf3fdacca6c05437d76f2f2964191d6.jpg,Image,"Collection d'images : Observatoire de Paris - site de Meudon",1,0
"Ancienne Résidence Impériale et Royale servant actuellement d'Observatoire, Château de Meudon - Façade sur la Forêt (titre original)",,P.M,"Observatoire de Paris. Site de Meudon",,,"Edition Trianon (éditeur)",,,,"Reproduction photomécanique",up-cosmos-Inv.I.1918,"Bibliothèque de l'Observatoire de Paris, Inv.I.1918",1904,,,,,,,"Bibliothèque de l'Observatoire de Paris",,,,"Voir la notice complète dans <a href=""https://cosmos.obspm.fr/index.php/Detail/objects/33020"">Cosmos</a>",,,,,,,,,,,,,,,,,,,,,,,"20e siècle",,,,,,,,,,,,,,,,,,,,,,,,,,,,,,,,,,,,,,,,,,,,,,,,,,,,,,,,,,,,,,,,,,,,"France,Observatoire de Paris. Site de Meudon,Observatoires",https://bibnum.obspm.fr/files/original/87a389f1b19451fa86f3893e544c48d4.jpg,Image,"Collection d'images : Observatoire de Paris - site de Meudon",1,0
"Centre de calcul de l'INAG - Observatoire de Meudon (titre forgé) / [2 images]",,inconnu,"Observatoire de Paris. Site de Meudon","Prise de vue originale",,,,,,Diapositive,up-FR751142302-AA001261,"Bibliothèque de l'Observatoire de Paris, Dp 197 et Dp 798",1970/1979,,,,,,,"Bibliothèque de l'Observatoire de Paris",,,,"Voir la notice complète dans <a href='http://www.calames.abes.fr/pub/obs.aspx' target='_blank'>Calames</a>",,,,,,,,,,,,,,,,,,,,,,,"20e siècle",,,,,,,,,,,,,,,,,,,,,,,,,,,,,,,,,,,,,,,,,,,,,,,,,,,,,,,,,,,,,,,,,,,,"France,Observatoire de Paris. Site de Meudon,Observatoires","https://bibnum.obspm.fr/files/original/c48f6a76bc34b7c0262eeb3264c75e1d.jpg,https://bibnum.obspm.fr/files/original/81353a833913d8bead44a90c0ac37ef5.jpg",Image,"Collection d'images : Observatoire de Paris - site de Meudon",1,0
"Château de Meudon (titre forgé)",,inconnu,"Observatoire de Paris. Site de Meudon",,,,,,,"Tirage photographique",up-cosmos-Inv.I.1869,"Bibliothèque de l'Observatoire de Paris, Inv.I.1869",s.d.,,,,,,,"Bibliothèque de l'Observatoire de Paris",,,,"Voir la notice complète dans <a href=""https://cosmos.obspm.fr/index.php/Detail/objects/32931"">Cosmos</a>",,,,,,,,,,,,,,,,,,,,,,,"19e siècle",,,,,,,,,,,,,,,,,,,,,,,,,,,,,,,,,,,,,,,,,,,,,,,,,,,,,,,,,,,,,,,,,,,,"France,Observatoire de Paris. Site de Meudon,Observatoires",https://bibnum.obspm.fr/files/original/f005735bc3c21df143745493e8c7205c.jpg,Image,"Collection d'images : Observatoire de Paris - site de Meudon",1,0
"Château de Meudon (titre forgé)",,inconnu,"Observatoire de Paris. Site de Meudon",,,,,,,"Tirage photographique",up-cosmos-PP92,"Bibliothèque de l'Observatoire de Paris, PP92",s.d.,,,,,,,"Bibliothèque de l'Observatoire de Paris",,,,"Voir la notice complète dans <a href=""https://cosmos.obspm.fr/index.php/Detail/objects/33565"">Cosmos</a>",,,,,,,,,,,,,,,,,,,,,,,"19e siècle",,,,,,,,,,,,,,,,,,,,,,,,,,,,,,,,,,,,,,,,,,,,,,,,,,,,,,,,,,,,,,,,,,,,"France,Observatoire de Paris. Site de Meudon,Observatoires",https://bibnum.obspm.fr/files/original/dfbc7152dd51335ac024b98a732d970b.jpg,Image,"Collection d'images : Observatoire de Paris - site de Meudon",1,0
"Château de Meudon (titre original)",,"Deroy, Isidore-Laurent (1797-1886)","Observatoire de Paris. Site de Meudon",,,,,,,Estampe,up-cosmos-Inv.I.1825,"Bibliothèque de l'Observatoire de Paris, Inv.I.1825",s.d.,,,,,,,"Bibliothèque de l'Observatoire de Paris",,,,"Voir la notice complète dans <a href=""https://cosmos.obspm.fr/index.php/Detail/objects/32823"">Cosmos</a>",,,,,,,,,,,,,,,,,,,,,,,"19e siècle",,,,,,,,,,,,,,,,,,,,,,,,,,,,,,,,,,,,,,,,,,,,,,,,,,,,,,,,,,,,,,,,,,,,"France,Observatoire de Paris. Site de Meudon,Observatoires",https://bibnum.obspm.fr/files/original/792b09ce862f23dc0cc83d40ff8d473f.jpg,Image,"Collection d'images : Observatoire de Paris - site de Meudon",1,0
"Château de Meudon après l'incendie de 1871 (titre forgé)",,inconnu,"Observatoire de Paris. Site de Meudon",,,,,,,"Tirage photographique",up-cosmos-Inv.I.1873,"Bibliothèque de l'Observatoire de Paris, Inv.I.1873",s.d.,,,,,,,"Bibliothèque de l'Observatoire de Paris",,,,"Voir la notice complète dans <a href=""https://cosmos.obspm.fr/index.php/Detail/objects/32935"">Cosmos</a>",,,,,,,,,,,,,,,,,,,,,,,"20e siècle",,,,,,,,,,,,,,,,,,,,,,,,,,,,,,,,,,,,,,,,,,,,,,,,,,,,,,,,,,,,,,,,,,,,"France,Observatoire de Paris. Site de Meudon,Observatoires",https://bibnum.obspm.fr/files/original/be29d3ccd5f446b1a92e1cfea768513a.jpg,Image,"Collection d'images : Observatoire de Paris - site de Meudon",1,0
"Château de Meudon après sa transformation en observatoire (titre forgé)",,inconnu,"Observatoire de Paris. Site de Meudon",,,,,,,"Tirage photographique",up-cosmos-Inv.I.1872,"Bibliothèque de l'Observatoire de Paris, Inv.I.1872",s.d.,,,,,,,"Bibliothèque de l'Observatoire de Paris",,,,"Voir la notice complète dans <a href=""https://cosmos.obspm.fr/index.php/Detail/objects/32934"">Cosmos</a>",,,,,,,,,,,,,,,,,,,,,,,"20e siècle",,,,,,,,,,,,,,,,,,,,,,,,,,,,,,,,,,,,,,,,,,,,,,,,,,,,,,,,,,,,,,,,,,,,"France,Observatoire de Paris. Site de Meudon,Observatoires",https://bibnum.obspm.fr/files/original/ffb207b3a1bbb39ed508517bc5e2576b.jpg,Image,"Collection d'images : Observatoire de Paris - site de Meudon",1,0
"Château de Meudon vers 1710 ; château de Chambord vers 1705 (titre original)",,"Ransonnette, Charles Nicolas (1793-1877)","Observatoire de Paris. Site de Meudon",,,,,,,Estampe,up-cosmos-Inv.I.1366,"Bibliothèque de l'Observatoire de Paris, Inv.I.1366",s.d.,,,,,,,"Bibliothèque de l'Observatoire de Paris",,,,"Voir la notice complète dans <a href=""https://cosmos.obspm.fr/index.php/Detail/objects/32088"">Cosmos</a>",,,,,,,,,,,,,,,,,,,,,,,"19e siècle",,,,,,,,,,,,,,,,,,,,,,,,,,,,,,,,,,,,,,,,,,,,,,,,,,,,,,,,,,,,,,,,,,,,"France,Observatoire de Paris. Site de Meudon,Observatoires",https://bibnum.obspm.fr/files/original/d19f8699ae82a640b6540f4afd340fed.jpg,Image,"Collection d'images : Observatoire de Paris - site de Meudon",1,0
"Coelostat de la tour solaire de l'Observatoire de Meudon (titre forgé) / [8 images]",,"Counil, Jean-Claude (1927-….)","Astronomie -- Instruments","Prise de vue originale",,,,,,Négatif,up-FR751142302-AB011971,"Bibliothèque de l'Observatoire de Paris, B1911a à B1911h",s.d.,,,,,,,"Bibliothèque de l'Observatoire de Paris",,,,"Voir la notice complète dans <a href='http://www.calames.abes.fr/pub/obs.aspx' target='_blank'>Calames</a>",,,,,,,,,,,,,,,,,,,,,,,"20e siècle",,,,,,,,,,,,,,,,,,,,,,,,,,,,,,,,,,,,,,,,,,,,,,,,,,,,,,,,,,,,,,,,,,,,"Astronomie -- Instruments,France,Observatoire de Paris. Site de Meudon,Observatoires","https://bibnum.obspm.fr/files/original/48bb1df8e52b2cc9dc4dce8a16806b14.jpg,https://bibnum.obspm.fr/files/original/ab2996f4b688a56d7c275c4256049b98.jpg,https://bibnum.obspm.fr/files/original/49e55687bd3f0f3cd5859b18057d70c2.jpg,https://bibnum.obspm.fr/files/original/2075b7abf1e869a06733977dd011d207.jpg,https://bibnum.obspm.fr/files/original/8e1a2d3013e38a043b85c88a9acd8251.jpg,https://bibnum.obspm.fr/files/original/4c666b1ef734e38c0fa22585535a5c55.jpg,https://bibnum.obspm.fr/files/original/4577459943364339b8c9702425b795a9.jpg,https://bibnum.obspm.fr/files/original/9b0c672501b72d627a82d7e354dc75ba.jpg",Image,"Collection d'images : Observatoire de Paris - site de Meudon",1,0
"Etat des travaux de la Grande Coupole de Meudon, photos adressées à Mr le directeur A. Danjon (titre forgé) / [23 images]",,inconnu,"Observatoire de Paris. Site de Meudon",,,,,,,"Tirage photographique","up-cosmos-Inv.I.1658 (1) à Inv.I.1658 (23)","Bibliothèque de l'Observatoire de Paris, Inv.I.1658 (1) à Inv.I.1658 (23)",1960,,,,,,,"Bibliothèque de l'Observatoire de Paris",,,,"Voir la notice complète dans <a href=""https://cosmos.obspm.fr/index.php/Detail/objects/34889"">Cosmos</a>",,,,,,,,,,,,,,,,,,,,,,,"20e siècle",,,,,,,,,,,,,,,,,,,,,,,,,,,,,,,,,,,,,,,,,,,,,,,,,,,,,,,,,,,,,,,,,,,,"France,Observatoire de Paris. Site de Meudon,Observatoires","https://bibnum.obspm.fr/files/original/5b60d55be77bd9d170e0c5967fcd9ebd.jpg,https://bibnum.obspm.fr/files/original/99852941ddeee56f55df9a70829c30fa.jpg,https://bibnum.obspm.fr/files/original/36be6b302477a63f8df4fe027aee7faa.jpg,https://bibnum.obspm.fr/files/original/5b443070c34d8ef72c1171b3f1b77478.jpg,https://bibnum.obspm.fr/files/original/009fb9a05b36402bea7111b1f1496572.jpg,https://bibnum.obspm.fr/files/original/95918df26817c7175ecf5684f0254f3a.jpg,https://bibnum.obspm.fr/files/original/67ee4dd9f01ee7a3a476a533bc99a267.jpg,https://bibnum.obspm.fr/files/original/436b4558ef7eaedcfe62dbf104835c6c.jpg,https://bibnum.obspm.fr/files/original/bacfaf35d801dbb02870ae4faf5d2666.jpg,https://bibnum.obspm.fr/files/original/b1cdc46325133a0b27cc6ada2f482ce5.jpg,https://bibnum.obspm.fr/files/original/0013f2fb8ab4d4e792b49f8465488e6a.jpg,https://bibnum.obspm.fr/files/original/aa3ab4d5c8065f6f2947bd58e046e217.jpg,https://bibnum.obspm.fr/files/original/99b01438226a1c774925af9f2693b8eb.jpg,https://bibnum.obspm.fr/files/original/5c159d4003904247224b2dbffc55cbcc.jpg,https://bibnum.obspm.fr/files/original/5e40404459b32c5f5a52418430489fec.jpg,https://bibnum.obspm.fr/files/original/1709e79268fad565daf94ab0a173eb14.jpg,https://bibnum.obspm.fr/files/original/92b3e9bf1c1277609b3e5efcdfca9759.jpg,https://bibnum.obspm.fr/files/original/0ff9500626f94571d18d14ee7bd53a53.jpg,https://bibnum.obspm.fr/files/original/80f6c27ac9df9841916044122328ab42.jpg,https://bibnum.obspm.fr/files/original/06a314e356bdd09c3778a443dd456943.jpg,https://bibnum.obspm.fr/files/original/468be077d4ba120f56aae171d2e33e7e.jpg,https://bibnum.obspm.fr/files/original/738f4fdbe303ddb71bf84c22629bc2d6.jpg,https://bibnum.obspm.fr/files/original/ce053296077ba8c248c245ac82b9bfe5.jpg,https://bibnum.obspm.fr/files/original/ee73af81e20274dfd5af88296c5e9967.jpg",Image,"Collection d'images : Observatoire de Paris - site de Meudon",1,0
"Extérieur du bâtiment 18 où se trouve la bibliothèque - Observatoire de Meudon (titre forgé)",,inconnu,"Observatoire de Paris. Site de Meudon","Prise de vue originale",,,,,,Diapositive,up-FR751142302-AA003821,"Bibliothèque de l'Observatoire de Paris, Dp 797",1970/1979,,,,,,,"Bibliothèque de l'Observatoire de Paris",,,,"Voir la notice complète dans <a href='http://www.calames.abes.fr/pub/obs.aspx' target='_blank'>Calames</a>",,,,,,,,,,,,,,,,,,,,,,,"20e siècle",,,,,,,,,,,,,,,,,,,,,,,,,,,,,,,,,,,,,,,,,,,,,,,,,,,,,,,,,,,,,,,,,,,,"France,Observatoire de Paris. Site de Meudon,Observatoires",https://bibnum.obspm.fr/files/original/2580f237cde5ac45c1bec331d96ede99.jpg,Image,"Collection d'images : Observatoire de Paris - site de Meudon",1,0
"Grande lunette de l'Observatoire de Meudon (titre forgé) / [3 images]",,"Counil, Jean-Claude (1927-….)","Astronomie -- Instruments","Prise de vue originale",,,,,,Négatif,up-FR751142302-AB001971,"Bibliothèque de l'Observatoire de Paris, B301a et B301c",s.d.,,,,,,,"Bibliothèque de l'Observatoire de Paris",,,,"Voir la notice complète dans <a href='http://www.calames.abes.fr/pub/obs.aspx' target='_blank'>Calames</a>",,,,,,,,,,,,,,,,,,,,,,,"20e siècle",,,,,,,,,,,,,,,,,,,,,,,,,,,,,,,,,,,,,,,,,,,,,,,,,,,,,,,,,,,,,,,,,,,,"Astronomie -- Instruments,France,Observatoire de Paris. Site de Meudon,Observatoires","https://bibnum.obspm.fr/files/original/a57ba5fe13119e61be826744897d888b.jpg,https://bibnum.obspm.fr/files/original/f656f733145054bcf88127c5032a7491.jpg",Image,"Collection d'images : Observatoire de Paris - site de Meudon",1,0
"Gros-plan d’une lunette devant un bâtiment à Meudon (titre forgé)",,inconnu,"Astronomie -- Instruments",,,,,,,"Tirage photographique",up-cosmos-PP78/41,"Bibliothèque de l'Observatoire de Paris, PP78/41",s.d.,,,,,,,"Bibliothèque de l'Observatoire de Paris",,,,"Voir la notice complète dans <a href=""https://cosmos.obspm.fr/index.php/Detail/objects/33534"">Cosmos</a>",,,,,,,,,,,,,,,,,,,,,,,"19e siècle",,,,,,,,,,,,,,,,,,,,,,,,,,,,,,,,,,,,,,,,,,,,,,,,,,,,,,,,,,,,,,,,,,,,"Astronomie -- Instruments,France,Observatoire de Paris. Site de Meudon,Observatoires",https://bibnum.obspm.fr/files/original/c101ce1ee142924c062d25752d0c6f74.jpg,Image,"Collection d'images : Observatoire de Paris - site de Meudon",1,0
"Instruments et bâtiments à Meudon (titre forgé)",,inconnu,"Astronomie -- Instruments",,,,,,,"Tirage photographique",up-cosmos-PP78/40,"Bibliothèque de l'Observatoire de Paris, PP78/40",s.d.,,,,,,,"Bibliothèque de l'Observatoire de Paris",,,,"Voir la notice complète dans <a href=""https://cosmos.obspm.fr/index.php/Detail/objects/33533"">Cosmos</a>",,,,,,,,,,,,,,,,,,,,,,,"19e siècle",,,,,,,,,,,,,,,,,,,,,,,,,,,,,,,,,,,,,,,,,,,,,,,,,,,,,,,,,,,,,,,,,,,,"Astronomie -- Instruments,France,Observatoire de Paris. Site de Meudon,Observatoires",https://bibnum.obspm.fr/files/original/1ee56ea6fd63d66232041c2d17631415.jpg,Image,"Collection d'images : Observatoire de Paris - site de Meudon",1,0
"Instruments et bâtiments à Meudon (titre forgé)",,inconnu,"Astronomie -- Instruments",,,,,,,"Tirage photographique",up-cosmos-PP78/42,"Bibliothèque de l'Observatoire de Paris, PP78/42",s.d.,,,,,,,"Bibliothèque de l'Observatoire de Paris",,,,"Voir la notice complète dans <a href=""https://cosmos.obspm.fr/index.php/Detail/objects/33535"">Cosmos</a>",,,,,,,,,,,,,,,,,,,,,,,"19e siècle",,,,,,,,,,,,,,,,,,,,,,,,,,,,,,,,,,,,,,,,,,,,,,,,,,,,,,,,,,,,,,,,,,,,"Astronomie -- Instruments,France,Observatoire de Paris. Site de Meudon,Observatoires",https://bibnum.obspm.fr/files/original/c81b528796068d319e3e86514b6883d8.jpg,Image,"Collection d'images : Observatoire de Paris - site de Meudon",1,0
"Instruments et bâtiments à Meudon (titre forgé) / [2 images]",,inconnu,"Astronomie -- Instruments",,,,,,,"Tirage photographique","up-cosmos-PP78/43 et PP78/44","Bibliothèque de l'Observatoire de Paris, PP78/43 et PP78/44",s.d.,,,,,,,"Bibliothèque de l'Observatoire de Paris",,,,"Voir la notice complète dans <a href=""https://cosmos.obspm.fr/index.php/Detail/objects/33536"">Cosmos</a>",,,,,,,,,,,,,,,,,,,,,,,"19e siècle",,,,,,,,,,,,,,,,,,,,,,,,,,,,,,,,,,,,,,,,,,,,,,,,,,,,,,,,,,,,,,,,,,,,"Astronomie -- Instruments,France,Observatoire de Paris. Site de Meudon,Observatoires","https://bibnum.obspm.fr/files/original/61bc523f5dba222987c7e4bd2dd59cfe.jpg,https://bibnum.obspm.fr/files/original/9958aa50b88939b1f1633ddca09bba0a.jpg",Image,"Collection d'images : Observatoire de Paris - site de Meudon",1,0
"Intérieur de la grande coupole de l'Observatoire de Meudon (titre forgé)",,"Photogravure Dujardin, Paris (photograveur)","Astronomie -- Instruments",,,,,,,Estampe,up-cosmos-PP90,"Bibliothèque de l'Observatoire de Paris, PP90",s.d.,,,,,,,"Bibliothèque de l'Observatoire de Paris",,,,"Voir la notice complète dans <a href=""https://cosmos.obspm.fr/index.php/Detail/objects/33563"">Cosmos</a>",,,,,,,,,,,,,,,,,,,,,,,"19e siècle",,,,,,,,,,,,,,,,,,,,,,,,,,,,,,,,,,,,,,,,,,,,,,,,,,,,,,,,,,,,,,,,,,,,"Astronomie -- Instruments,France,Observatoire de Paris. Site de Meudon,Observatoires",https://bibnum.obspm.fr/files/original/91de57e8e78ddd756b242ec767c8f2c5.jpg,Image,"Collection d'images : Observatoire de Paris - site de Meudon",1,0
"La coupole de la grande lunette - Observatoire de Meudon (titre forgé)",,"Counil, Jean-Claude (1927-….)","Observatoire de Paris. Site de Meudon","Prise de vue originale",,,,,,Négatif,up-FR751142302-AB012161,"Bibliothèque de l'Observatoire de Paris, B1917",s.d.,,,,,,,"Bibliothèque de l'Observatoire de Paris",,,,"Voir la notice complète dans <a href='http://www.calames.abes.fr/pub/obs.aspx' target='_blank'>Calames</a>",,,,,,,,,,,,,,,,,,,,,,,"20e siècle",,,,,,,,,,,,,,,,,,,,,,,,,,,,,,,,,,,,,,,,,,,,,,,,,,,,,,,,,,,,,,,,,,,,"France,Observatoire de Paris. Site de Meudon,Observatoires",https://bibnum.obspm.fr/files/original/ed5bedc58c80809b8c0da4f0abe1eebd.jpg,Image,"Collection d'images : Observatoire de Paris - site de Meudon",1,0
"La grande coupole et le château - Observatoire de Meudon (titre forgé)",,inconnu,"Observatoire de Paris. Site de Meudon","Prise de vue originale",,,,,,Diapositive,up-FR751142302-AA001151,"Bibliothèque de l'Observatoire de Paris, Dp 186",1970/1979,,,,,,,"Bibliothèque de l'Observatoire de Paris",,,,"Voir la notice complète dans <a href='http://www.calames.abes.fr/pub/obs.aspx' target='_blank'>Calames</a>",,,,,,,,,,,,,,,,,,,,,,,"20e siècle",,,,,,,,,,,,,,,,,,,,,,,,,,,,,,,,,,,,,,,,,,,,,,,,,,,,,,,,,,,,,,,,,,,,"France,Observatoire de Paris. Site de Meudon,Observatoires",https://bibnum.obspm.fr/files/original/67866ec8fbc766a8c5f2262cb06efe2d.jpg,Image,"Collection d'images : Observatoire de Paris - site de Meudon",1,0
"La grande coupole et le château - Observatoire de Meudon (titre forgé) / [2 images]",,"Counil, Jean-Claude (1927-….)","Observatoire de Paris. Site de Meudon","Prise de vue originale",,,,,,Négatif,up-FR751142302-AB003601,"Bibliothèque de l'Observatoire de Paris, B676a et B676b",s.d.,,,,,,,"Bibliothèque de l'Observatoire de Paris",,,,"Voir la notice complète dans <a href='http://www.calames.abes.fr/pub/obs.aspx' target='_blank'>Calames</a>",,,,,,,,,,,,,,,,,,,,,,,"20e siècle",,,,,,,,,,,,,,,,,,,,,,,,,,,,,,,,,,,,,,,,,,,,,,,,,,,,,,,,,,,,,,,,,,,,"France,Observatoire de Paris. Site de Meudon,Observatoires","https://bibnum.obspm.fr/files/original/138c83877758f2d11c16112bee0be394.jpg,https://bibnum.obspm.fr/files/original/194c7cdf4a61faeb9efe5346c991ab1f.jpg",Image,"Collection d'images : Observatoire de Paris - site de Meudon",1,0
"La grande lunette de l'Observatoire de Meudon : partie oculaire et commandes (titre forgé)",,"Counil, Jean-Claude (1927-….)","Astronomie -- Instruments","Prise de vue originale",,,,,,Négatif,up-FR751142302-AB011171,"Bibliothèque de l'Observatoire de Paris, B1861",s.d.,,,,,,,"Bibliothèque de l'Observatoire de Paris",,,,"Voir la notice complète dans <a href='http://www.calames.abes.fr/pub/obs.aspx' target='_blank'>Calames</a>",,,,,,,,,,,,,,,,,,,,,,,"20e siècle",,,,,,,,,,,,,,,,,,,,,,,,,,,,,,,,,,,,,,,,,,,,,,,,,,,,,,,,,,,,,,,,,,,,"Astronomie -- Instruments,France,Observatoire de Paris. Site de Meudon,Observatoires",https://bibnum.obspm.fr/files/original/155b5ba7c38d48fd27443b298c899ae7.jpg,Image,"Collection d'images : Observatoire de Paris - site de Meudon",1,0
"La grande lunette de l'Observatoire de Meudon : pupitre de commandes (titre forgé) / [2 images]",,"Counil, Jean-Claude (1927-….)","Astronomie -- Instruments","Prise de vue originale",,,,,,Négatif,up-FR751142302-AB011181,"Bibliothèque de l'Observatoire de Paris, B1862a et B1862b",s.d.,,,,,,,"Bibliothèque de l'Observatoire de Paris",,,,"Voir la notice complète dans <a href='http://www.calames.abes.fr/pub/obs.aspx' target='_blank'>Calames</a>",,,,,,,,,,,,,,,,,,,,,,,"20e siècle",,,,,,,,,,,,,,,,,,,,,,,,,,,,,,,,,,,,,,,,,,,,,,,,,,,,,,,,,,,,,,,,,,,,"Astronomie -- Instruments,France,Observatoire de Paris. Site de Meudon,Observatoires","https://bibnum.obspm.fr/files/original/dcbd2dda9a9c9acee27e1d93226ccc43.jpg,https://bibnum.obspm.fr/files/original/4f4beb418d521b413606fb7261449141.jpg",Image,"Collection d'images : Observatoire de Paris - site de Meudon",1,0
"La grande lunette de l'Observatoire de Paris à Meudon […] (titre original)",,inconnu,"Astronomie -- Instruments",,,"Edition du Castelet (éditeur)",,,,"Reproduction photomécanique",up-cosmos-Inv.I.1814,"Bibliothèque de l'Observatoire de Paris, Inv.I.1814",s.d.,,,,,,,"Bibliothèque de l'Observatoire de Paris",,,,"Voir la notice complète dans <a href=""https://cosmos.obspm.fr/index.php/Detail/objects/32812"">Cosmos</a>",,,,,,,,,,,,,,,,,,,,,,,"20e siècle",,,,,,,,,,,,,,,,,,,,,,,,,,,,,,,,,,,,,,,,,,,,,,,,,,,,,,,,,,,,,,,,,,,,"Astronomie -- Instruments,France,Observatoire de Paris. Site de Meudon,Observatoires",https://bibnum.obspm.fr/files/original/9dcf336c52967035159ccc15f0bcc0bf.jpg,Image,"Collection d'images : Observatoire de Paris - site de Meudon",1,0