﻿"Dublin Core:Title","Dublin Core:Titre alternatif","Dublin Core:Creator","Dublin Core:Subject","Dublin Core:Description","Dublin Core:Publisher","Dublin Core:Contributor","Dublin Core:Format","Dublin Core:Extent","Dublin Core:Medium","Dublin Core:Type","Dublin Core:Identifier","Dublin Core:Source","Dublin Core:Date","Dublin Core:Language","Dublin Core:Is Part Of","Dublin Core:Has Version","Dublin Core:Coverage","Dublin Core:Provenance","Dublin Core:Rights Holder","Dublin Core:Rights","Dublin Core:Abstract","Dublin Core:Table Of Contents","Dublin Core:Date Available","Dublin Core:Relation","Dublin Core:Date Accepted","Dublin Core:Date Copyrighted","Dublin Core:Date Submitted","Dublin Core:Date Created","Dublin Core:Date Issued","Dublin Core:Date Modified","Dublin Core:Date Valid","Dublin Core:Access Rights","Dublin Core:License","Dublin Core:Conforms To","Dublin Core:Has Format","Dublin Core:Has Part","Dublin Core:Is Format Of","Dublin Core:Is Referenced By","Dublin Core:Is Replaced By","Dublin Core:Is Required By","Dublin Core:Is Version Of","Dublin Core:References","Dublin Core:Replaces","Dublin Core:Requires","Dublin Core:Bibliographic Citation","Dublin Core:Spatial Coverage","Dublin Core:Temporal Coverage","Dublin Core:Accrual Method","Dublin Core:Accrual Periodicity","Dublin Core:Accrual Policy","Dublin Core:Audience","Dublin Core:Audience Education Level","Dublin Core:Mediator","Dublin Core:Instructional Method","Item Type Metadata:Text","Item Type Metadata:Interviewer","Item Type Metadata:Interviewee","Item Type Metadata:Location","Item Type Metadata:Transcription","Item Type Metadata:Local URL","Item Type Metadata:Original Format","Item Type Metadata:Physical Dimensions","Item Type Metadata:Duration","Item Type Metadata:Compression","Item Type Metadata:Producer","Item Type Metadata:Director","Item Type Metadata:Bit Rate/Frequency","Item Type Metadata:Time Summary","Item Type Metadata:Email Body","Item Type Metadata:Subject Line","Item Type Metadata:From","Item Type Metadata:To","Item Type Metadata:CC","Item Type Metadata:BCC","Item Type Metadata:Number of Attachments","Item Type Metadata:Standards","Item Type Metadata:Objectives","Item Type Metadata:Materials","Item Type Metadata:Lesson Plan Text","Item Type Metadata:URL","Item Type Metadata:Event Type","Item Type Metadata:Participants","Item Type Metadata:Birth Date","Item Type Metadata:Birthplace","Item Type Metadata:Death Date","Item Type Metadata:Occupation","Item Type Metadata:Biographical Text","Item Type Metadata:Bibliography","Item Type Metadata:Edition Statement","Item Type Metadata:Publication Statement","Item Type Metadata:Note statement","Item Type Metadata:Profile description : Creation","Item Type Metadata:Profile description : Descriptive Rules","Item Type Metadata:Profile description : Language Usage","Item Type Metadata:Revision Description : Change","Item Type Metadata:Revision Description : List","Item Type Metadata:Front matter : Title page","Item Type Metadata:Front matter : Division","Item Type Metadata:Player","Visiteur Elements:Dites des choses","PDF Text:Text","EAD Archive:Descriptive Identification : Heading","EAD Archive:Descriptive Identification : Note","EAD Archive:Appraisal Information","EAD Archive:Arrangement","EAD Archive:Biography or History","EAD Archive:Index","EAD Archive:Level","EAD Archive:Note","EAD Archive:Other Descriptive Data","EAD Archive:Processing Information","EAD Archive:Scope and Content","EAD Archive:Heading","EAD Archive:Table Head",tags,file,itemType,collection,public,featured
"Observatoire de Paris - section de Meudon : La dentelle du Cygne […] (titre original)",,inconnu,Nébuleuses,,,"Yvon (éditeur / imprimeur / commanditaire)",,,,"Reproduction photomécanique",up-cosmos-Inv.I.1789,"Bibliothèque de l'Observatoire de Paris, Inv.I.1789",s.d.,,,,,,,"Bibliothèque de l'Observatoire de Paris",,,,"Voir la notice complète dans <a href=""https://cosmos.obspm.fr/index.php/Detail/objects/32783"">Cosmos</a>",,,,,,,,,,,,,,,,,,,,,,,"20e siècle",,,,,,,,,,,,,,,,,,,,,,,,,,,,,,,,,,,,,,,,,,,,,,,,,,,,,,,,,,,,,,,,,,,,Nébuleuses,https://bibnum.obspm.fr/files/original/491893f040a827dca2319c3b49501ff9.jpg,Image,"Collection d'images : Observations astronomiques",1,0
"Observatoire de Paris - section de Meudon : La nébuleuse planétaire de Dumbbell […] (titre original)",,inconnu,Nébuleuses,,,"Yvon (éditeur / imprimeur / commanditaire)",,,,"Reproduction photomécanique",up-cosmos-Inv.I.1790,"Bibliothèque de l'Observatoire de Paris, Inv.I.1790",s.d.,,,,,,,"Bibliothèque de l'Observatoire de Paris",,,,"Voir la notice complète dans <a href=""https://cosmos.obspm.fr/index.php/Detail/objects/32785"">Cosmos</a>",,,,,,,,,,,,,,,,,,,,,,,"20e siècle",,,,,,,,,,,,,,,,,,,,,,,,,,,,,,,,,,,,,,,,,,,,,,,,,,,,,,,,,,,,,,,,,,,,Nébuleuses,https://bibnum.obspm.fr/files/original/192d5b8657caa700645fafb10d02d44d.jpg,Image,"Collection d'images : Observations astronomiques",1,0
"Observatoire de Toulouse : Nébuleuse annulaire de la Lyre, agrandissement 64 fois (titre original)",,inconnu,Nébuleuses,,,,,,,"Tirage photographique",up-cosmos-Inv.I.963,"Bibliothèque de l'Observatoire de Paris, Inv.I.963",1879,,,,,,,"Bibliothèque de l'Observatoire de Paris",,,,"Voir la notice complète dans <a href=""https://cosmos.obspm.fr/index.php/Detail/objects/31684"">Cosmos</a>",,,,,,,,,,,,,,,,,,,,,,,"19e siècle",,,,,,,,,,,,,,,,,,,,,,,,,,,,,,,,,,,,,,,,,,,,,,,,,,,,,,,,,,,,,,,,,,,,Nébuleuses,https://bibnum.obspm.fr/files/original/35203dcb4bd9810b1a7771d73ef26d9a.jpg,Image,"Collection d'images : Observations astronomiques",1,0
"Observatoire de Toulouse : Nébuleuse annulaire de la Lyre, agrandissement 8 fois (titre original)",,inconnu,Nébuleuses,,,,,,,"Tirage photographique",up-cosmos-Inv.I.964,"Bibliothèque de l'Observatoire de Paris, Inv.I.964",1879,,,,,,,"Bibliothèque de l'Observatoire de Paris",,,,"Voir la notice complète dans <a href=""https://cosmos.obspm.fr/index.php/Detail/objects/31685"">Cosmos</a>",,,,,,,,,,,,,,,,,,,,,,,"19e siècle",,,,,,,,,,,,,,,,,,,,,,,,,,,,,,,,,,,,,,,,,,,,,,,,,,,,,,,,,,,,,,,,,,,,Nébuleuses,https://bibnum.obspm.fr/files/original/aca1db6e68391a8aa78dade72d858f93.jpg,Image,"Collection d'images : Observations astronomiques",1,0
"Observatoire du Cap de Bonne-Espérance. Photographie de la nébuleuse entourant ? Argus, 3 mars 1892, durée de la pose 3h 12m, agrandissement 3 fois ½. Reproduction de la partie centrale d’un cliché de 2° sur 2° contenant 30 à 40 000 étoiles (titre original)",,"Gill, David (1843-1914)",Nébuleuses,,,,,,,"Tirage photographique",up-cosmos-Inv.I.1382,"Bibliothèque de l'Observatoire de Paris, Inv.I.1382",1892,,,,,,,"Bibliothèque de l'Observatoire de Paris",,,,"Voir la notice complète dans <a href=""https://cosmos.obspm.fr/index.php/Detail/objects/32104"">Cosmos</a>",,,,,,,,,,,,,,,,,,,,,,,"19e siècle",,,,,,,,,,,,,,,,,,,,,,,,,,,,,,,,,,,,,,,,,,,,,,,,,,,,,,,,,,,,,,,,,,,,Nébuleuses,https://bibnum.obspm.fr/files/original/113bae5c6254ece83b5ebee85c31843c.jpg,Image,"Collection d'images : Observations astronomiques",1,0
"Orion, 14-03-1899, x2, 1h, pris au grand télescope de Meudon. (titre forgé)",,"Rabourdin, Louis (1858-1936)",Nébuleuses,,,,,,,"Tirage photographique",up-cosmos-PP1/24,"Bibliothèque de l'Observatoire de Paris, PP1/24",1899,,,,,,,"Bibliothèque de l'Observatoire de Paris",,,,"Voir la notice complète dans <a href=""https://cosmos.obspm.fr/index.php/Detail/objects/33403"">Cosmos</a>",,,,,,,,,,,,,,,,,,,,,,,"19e siècle",,,,,,,,,,,,,,,,,,,,,,,,,,,,,,,,,,,,,,,,,,,,,,,,,,,,,,,,,,,,,,,,,,,,Nébuleuses,https://bibnum.obspm.fr/files/original/802e2abda13de36a54b3064aefa98e1d.jpg,Image,"Collection d'images : Observations astronomiques",1,0
"Orion, 15-03-1899, x2, 1h15, pris au grand télescope de Meudon. (titre forgé)",,"Rabourdin, Louis (1858-1936)",Nébuleuses,,,,,,,"Tirage photographique",up-cosmos-PP1/23,"Bibliothèque de l'Observatoire de Paris, PP1/23",1899,,,,,,,"Bibliothèque de l'Observatoire de Paris",,,,"Voir la notice complète dans <a href=""https://cosmos.obspm.fr/index.php/Detail/objects/33402"">Cosmos</a>",,,,,,,,,,,,,,,,,,,,,,,"19e siècle",,,,,,,,,,,,,,,,,,,,,,,,,,,,,,,,,,,,,,,,,,,,,,,,,,,,,,,,,,,,,,,,,,,,Nébuleuses,https://bibnum.obspm.fr/files/original/34af9ca569cb724d105b0269c92246a4.jpg,Image,"Collection d'images : Observations astronomiques",1,0
"Petit Renard, 02-08-1897, x10, 1h, pris au grand télescope de Meudon. (titre forgé)",,"Rabourdin, Louis (1858-1936)",Nébuleuses,,,,,,,"Tirage photographique",up-cosmos-PP1/14,"Bibliothèque de l'Observatoire de Paris, PP1/14",1897,,,,,,,"Bibliothèque de l'Observatoire de Paris",,,,"Voir la notice complète dans <a href=""https://cosmos.obspm.fr/index.php/Detail/objects/33393"">Cosmos</a>",,,,,,,,,,,,,,,,,,,,,,,"19e siècle",,,,,,,,,,,,,,,,,,,,,,,,,,,,,,,,,,,,,,,,,,,,,,,,,,,,,,,,,,,,,,,,,,,,Nébuleuses,https://bibnum.obspm.fr/files/original/aac9e68be41cc9b80af7cdda214b9ffd.jpg,Image,"Collection d'images : Observations astronomiques",1,0
"Petit Renard, 17-08-1898, x10, 30mn, pris au grand télescope de Meudon. (titre forgé)",,"Rabourdin, Louis (1858-1936)",Nébuleuses,,,,,,,"Tirage photographique",up-cosmos-PP1/38,"Bibliothèque de l'Observatoire de Paris, PP1/38",1898,,,,,,,"Bibliothèque de l'Observatoire de Paris",,,,"Voir la notice complète dans <a href=""https://cosmos.obspm.fr/index.php/Detail/objects/33417"">Cosmos</a>",,,,,,,,,,,,,,,,,,,,,,,"19e siècle",,,,,,,,,,,,,,,,,,,,,,,,,,,,,,,,,,,,,,,,,,,,,,,,,,,,,,,,,,,,,,,,,,,,Nébuleuses,https://bibnum.obspm.fr/files/original/b8aa676c94dba06d027cbc50851de833.jpg,Image,"Collection d'images : Observations astronomiques",1,0
"Petit Renard, 19-08-1897, x10, 1h12, pris au grand télescope de Meudon. (titre forgé)",,"Rabourdin, Louis (1858-1936)",Nébuleuses,,,,,,,"Tirage photographique",up-cosmos-PP1/13,"Bibliothèque de l'Observatoire de Paris, PP1/13",1897,,,,,,,"Bibliothèque de l'Observatoire de Paris",,,,"Voir la notice complète dans <a href=""https://cosmos.obspm.fr/index.php/Detail/objects/33392"">Cosmos</a>",,,,,,,,,,,,,,,,,,,,,,,"19e siècle",,,,,,,,,,,,,,,,,,,,,,,,,,,,,,,,,,,,,,,,,,,,,,,,,,,,,,,,,,,,,,,,,,,,Nébuleuses,https://bibnum.obspm.fr/files/original/3a088880acf26cf963ca495e64bea461.jpg,Image,"Collection d'images : Observations astronomiques",1,0
"Petit Renard, 23-09-1897, x10, 2h, pris au grand télescope de Meudon. (titre forgé)",,"Rabourdin, Louis (1858-1936)",Nébuleuses,,,,,,,"Tirage photographique",up-cosmos-PP1/15,"Bibliothèque de l'Observatoire de Paris, PP1/15",1897,,,,,,,"Bibliothèque de l'Observatoire de Paris",,,,"Voir la notice complète dans <a href=""https://cosmos.obspm.fr/index.php/Detail/objects/33394"">Cosmos</a>",,,,,,,,,,,,,,,,,,,,,,,"19e siècle",,,,,,,,,,,,,,,,,,,,,,,,,,,,,,,,,,,,,,,,,,,,,,,,,,,,,,,,,,,,,,,,,,,,Nébuleuses,https://bibnum.obspm.fr/files/original/c0bacd720dbce3e3870b6496f0857e90.jpg,Image,"Collection d'images : Observations astronomiques",1,0
"Petit Renard, Rosse, pris au grand télescope de Meudon. (titre forgé)",,"Rabourdin, Louis (1858-1936)",Nébuleuses,,,,,,,"Tirage photographique",up-cosmos-PP1/12,"Bibliothèque de l'Observatoire de Paris, PP1/12",s.d.,,,,,,,"Bibliothèque de l'Observatoire de Paris",,,,"Voir la notice complète dans <a href=""https://cosmos.obspm.fr/index.php/Detail/objects/33391"">Cosmos</a>",,,,,,,,,,,,,,,,,,,,,,,"19e siècle",,,,,,,,,,,,,,,,,,,,,,,,,,,,,,,,,,,,,,,,,,,,,,,,,,,,,,,,,,,,,,,,,,,,Nébuleuses,https://bibnum.obspm.fr/files/original/60a3124311f3e840971489dc85813f53.jpg,Image,"Collection d'images : Observations astronomiques",1,0
"Photograph of the Nebula 405 Persei […]. Exposure 90 minutes, on the 14th Januay 1902 (titre original)",,"Roberts, Isaac (1829-1904)",Nébuleuses,,,,,,,"Tirage photographique",up-cosmos-Inv.I.1481,"Bibliothèque de l'Observatoire de Paris, Inv.I.1481",1902,,,,,,,"Bibliothèque de l'Observatoire de Paris",,,,"Voir la notice complète dans <a href=""https://cosmos.obspm.fr/index.php/Detail/objects/32233"">Cosmos</a>",,,,,,,,,,,,,,,,,,,,,,,"20e siècle",,,,,,,,,,,,,,,,,,,,,,,,,,,,,,,,,,,,,,,,,,,,,,,,,,,,,,,,,,,,,,,,,,,,Nébuleuses,https://bibnum.obspm.fr/files/original/ab8fc23a983fefbd345497bba2f90185.jpg,Image,"Collection d'images : Observations astronomiques",1,0
"Photograph of the Nebula in Orion, taken by Professor Henry Draper, M.D., March 11th, 1881. Exposure 104 minutes. (titre original)",,inconnu,Nébuleuses,,,"Harroun & Bierstadt (imprimeur)",,,,"Tirage photographique",up-cosmos-Inv.I.1376,"Bibliothèque de l'Observatoire de Paris, Inv.I.1376",1881,,,,,,,"Bibliothèque de l'Observatoire de Paris",,,,"Voir la notice complète dans <a href=""https://cosmos.obspm.fr/index.php/Detail/objects/32098"">Cosmos</a>",,,,,,,,,,,,,,,,,,,,,,,"19e siècle",,,,,,,,,,,,,,,,,,,,,,,,,,,,,,,,,,,,,,,,,,,,,,,,,,,,,,,,,,,,,,,,,,,,Nébuleuses,https://bibnum.obspm.fr/files/original/8cf9cf7c6f0ea4c87d657edfe7f881c2.jpg,Image,"Collection d'images : Observations astronomiques",1,0
"Photograph of the Nebula in Orion, taken by Professor Henry Draper, M.D., March 14th, 1882. Exposure 137 minutes (titre original)",,inconnu,Nébuleuses,,,"Harroun & Bierstadt (imprimeur)",,,,"Tirage photographique",up-cosmos-Inv.I.1377,"Bibliothèque de l'Observatoire de Paris, Inv.I.1377",1882,,,,,,,"Bibliothèque de l'Observatoire de Paris",,,,"Voir la notice complète dans <a href=""https://cosmos.obspm.fr/index.php/Detail/objects/32099"">Cosmos</a>",,,,,,,,,,,,,,,,,,,,,,,"19e siècle",,,,,,,,,,,,,,,,,,,,,,,,,,,,,,,,,,,,,,,,,,,,,,,,,,,,,,,,,,,,,,,,,,,,Nébuleuses,https://bibnum.obspm.fr/files/original/2b6bcac51573544670465821bde2d3ae.jpg,Image,"Collection d'images : Observations astronomiques",1,0
"Photographies obtenues à l’observatoire de Meudon par M. Louis Rabourdin : nébuleuse de la Lyre. Télescope 1m ouverture, 3m distance focale ; pose 20 m ; agrandissement 25 fois ; date 23 juin 1897 (titre original)",,"Rabourdin, Louis (1858-1936)",Nébuleuses,,,,,,,"Tirage photographique",up-cosmos-Inv.I.1214,"Bibliothèque de l'Observatoire de Paris, Inv.I.1214",1897,,,,,,,"Bibliothèque de l'Observatoire de Paris",,,,"Voir la notice complète dans <a href=""https://cosmos.obspm.fr/index.php/Detail/objects/31936"">Cosmos</a>",,,,,,,,,,,,,,,,,,,,,,,"19e siècle",,,,,,,,,,,,,,,,,,,,,,,,,,,,,,,,,,,,,,,,,,,,,,,,,,,,,,,,,,,,,,,,,,,,Nébuleuses,https://bibnum.obspm.fr/files/original/4c9d0e08d89f065344da88ccbc26401e.jpg,Image,"Collection d'images : Observations astronomiques",1,0
"Photographies obtenues à l’observatoire de Meudon par M. Louis Rabourdin : nébuleuse de la Lyre. Télescope 1m ouverture, 3m distance focale ; pose 35 m ; agrandissement 25 fois ; date 22 juillet 1897 (titre original)",,"Rabourdin, Louis (1858-1936)",Nébuleuses,,,,,,,"Tirage photographique",up-cosmos-Inv.I.948,"Bibliothèque de l'Observatoire de Paris, Inv.I.948",1897,,,,,,,"Bibliothèque de l'Observatoire de Paris",,,,"Voir la notice complète dans <a href=""https://cosmos.obspm.fr/index.php/Detail/objects/31669"">Cosmos</a>",,,,,,,,,,,,,,,,,,,,,,,"19e siècle",,,,,,,,,,,,,,,,,,,,,,,,,,,,,,,,,,,,,,,,,,,,,,,,,,,,,,,,,,,,,,,,,,,,Nébuleuses,https://bibnum.obspm.fr/files/original/d998f9184593022d49c9ff57589a57a2.jpg,Image,"Collection d'images : Observations astronomiques",1,0
"Photographies obtenues à l’observatoire de Meudon par M. Louis Rabourdin : nébuleuse de la Lyre. Télescope 1m ouverture, 3m distance focale ; pose 53 m ; agrandissement 25 fois ; date 26 juin 1897 (titre original) / [2 images]",,"Rabourdin, Louis (1858-1936)",Nébuleuses,,,,,,,"Tirage photographique","up-cosmos-Inv.I.946 et Inv.I.947","Bibliothèque de l'Observatoire de Paris, Inv.I.946 et Inv.I.947",1897,,,,,,,"Bibliothèque de l'Observatoire de Paris",,,,"Voir la notice complète dans <a href=""https://cosmos.obspm.fr/index.php/Search/objects?search=ca_objects.recherche_simple%3A%2226+juin+1897%22"">Cosmos</a>",,,,,,,,,,,,,,,,,,,,,,,"19e siècle",,,,,,,,,,,,,,,,,,,,,,,,,,,,,,,,,,,,,,,,,,,,,,,,,,,,,,,,,,,,,,,,,,,,Nébuleuses,"https://bibnum.obspm.fr/files/original/e8945497160ca382c634fde0cef9dbe4.jpg,https://bibnum.obspm.fr/files/original/a5b31bed040b01d7e9a767ac81a868d1.jpg",Image,"Collection d'images : Observations astronomiques",1,0
"Photographies obtenues à l’observatoire de Meudon par M. Louis Rabourdin : nébuleuse du Petit Renard. Télescope 1m ouverture, 3m distance focale ; pose 1 h ; agrandissement 10 fois ; date 2 août 1897 (titre original) / [2 images]",,"Rabourdin, Louis (1858-1936)",Nébuleuses,,,,,,,"Tirage photographique","up-cosmos-Inv.I.949 et Inv.I.950","Bibliothèque de l'Observatoire de Paris, Inv.I.949 et Inv.I.950",1897,,,,,,,"Bibliothèque de l'Observatoire de Paris",,,,"Voir la notice complète dans <a href=""https://cosmos.obspm.fr/index.php/Search/objects?search=ca_objects.recherche_simple%3A%222+ao%C3%BBt+1897%22"">Cosmos</a>",,,,,,,,,,,,,,,,,,,,,,,"19e siècle",,,,,,,,,,,,,,,,,,,,,,,,,,,,,,,,,,,,,,,,,,,,,,,,,,,,,,,,,,,,,,,,,,,,Nébuleuses,"https://bibnum.obspm.fr/files/original/f78ad6b35f3383c11b3b7455e751e518.jpg,https://bibnum.obspm.fr/files/original/20269aec2bf18938bdc616b92fa21315.jpg",Image,"Collection d'images : Observations astronomiques",1,0
"Photographies obtenues à l’observatoire de Meudon par M. Louis Rabourdin : nébuleuse du Petit Renard. Télescope 1m ouverture, 3m distance focale ; pose 1 h 12 m ; agrandissement 10 fois ; date 19 août 1897 (titre original) / [2 images]",,"Rabourdin, Louis (1858-1936)",Nébuleuses,,,,,,,"Tirage photographique","up-cosmos-Inv.I.951 et Inv.I.952","Bibliothèque de l'Observatoire de Paris, Inv.I.951 et Inv.I.952",1897,,,,,,,"Bibliothèque de l'Observatoire de Paris",,,,"Voir la notice complète dans <a href=""https://cosmos.obspm.fr/index.php/Search/objects?search=ca_objects.recherche_simple%3A%2219+ao%C3%BBt+1897%22"">Cosmos</a>",,,,,,,,,,,,,,,,,,,,,,,"19e siècle",,,,,,,,,,,,,,,,,,,,,,,,,,,,,,,,,,,,,,,,,,,,,,,,,,,,,,,,,,,,,,,,,,,,Nébuleuses,"https://bibnum.obspm.fr/files/original/7fd66e179e5c597a82fedbe7cd7ae1bc.jpg,https://bibnum.obspm.fr/files/original/16ed745d8a7bdb4e2e0922da261d0ceb.jpg",Image,"Collection d'images : Observations astronomiques",1,0
"Photographies obtenues à l’observatoire de Meudon par M. Louis Rabourdin : nébuleuse du Triangle. Télescope 1m ouverture, 3m distance focale ; pose 2 h ; agrandissement 2 fois ; date 29 octobre 1897 (titre original)",,"Rabourdin, Louis (1858-1936)",Nébuleuses,,,,,,,"Tirage photographique",up-cosmos-Inv.I.956,"Bibliothèque de l'Observatoire de Paris, Inv.I.956",1897,,,,,,,"Bibliothèque de l'Observatoire de Paris",,,,"Voir la notice complète dans <a href=""https://cosmos.obspm.fr/index.php/Detail/objects/31677"">Cosmos</a>",,,,,,,,,,,,,,,,,,,,,,,"19e siècle",,,,,,,,,,,,,,,,,,,,,,,,,,,,,,,,,,,,,,,,,,,,,,,,,,,,,,,,,,,,,,,,,,,,Nébuleuses,https://bibnum.obspm.fr/files/original/d813e1a308d76645909a55ef7f2d4e35.jpg,Image,"Collection d'images : Observations astronomiques",1,0
"Photographies obtenues à l’observatoire de Meudon par M. Louis Rabourdin : nébuleuse du Triangle. Télescope 1m ouverture, 3m distance focale ; pose 2 h ; agrandissement 2 fois ; date 29 octobre 1897 (titre original)",,"Rabourdin, Louis (1858-1936)",Nébuleuses,,,,,,,"Tirage photographique",up-cosmos-Inv.I.957,"Bibliothèque de l'Observatoire de Paris, Inv.I.957",1897,,,,,,,"Bibliothèque de l'Observatoire de Paris",,,,"Voir la notice complète dans <a href=""https://cosmos.obspm.fr/index.php/Detail/objects/31678"">Cosmos</a>",,,,,,,,,,,,,,,,,,,,,,,"19e siècle",,,,,,,,,,,,,,,,,,,,,,,,,,,,,,,,,,,,,,,,,,,,,,,,,,,,,,,,,,,,,,,,,,,,Nébuleuses,https://bibnum.obspm.fr/files/original/faa32c9d672f930053f22194ac0b2053.jpg,Image,"Collection d'images : Observations astronomiques",1,0
"Photographies obtenues à l’observatoire de Meudon par M. Louis Rabourdin : nébuleuse du Verseau. Télescope 1m ouverture, 3m distance focale ; pose 50 m ; agrandissement 10 fois ; date 23 septembre 1897 (titre original)",,"Rabourdin, Louis (1858-1936)",Nébuleuses,,,,,,,"Tirage photographique",up-cosmos-Inv.I.953,"Bibliothèque de l'Observatoire de Paris, Inv.I.953",1897,,,,,,,"Bibliothèque de l'Observatoire de Paris",,,,"Voir la notice complète dans <a href=""https://cosmos.obspm.fr/index.php/Detail/objects/31674"">Cosmos</a>",,,,,,,,,,,,,,,,,,,,,,,"19e siècle",,,,,,,,,,,,,,,,,,,,,,,,,,,,,,,,,,,,,,,,,,,,,,,,,,,,,,,,,,,,,,,,,,,,Nébuleuses,https://bibnum.obspm.fr/files/original/89167c778757e9d06cc43edcaa42b516.jpg,Image,"Collection d'images : Observations astronomiques",1,0
"Photographies obtenues à l’observatoire de Meudon par M. Louis Rabourdin : nébuleuse du Verseau. Télescope 1m ouverture, 3m distance focale ; pose 50 m ; agrandissement 10 fois ; date 23 septembre 1897 (titre original)",,"Rabourdin, Louis (1858-1936)",Nébuleuses,,,,,,,"Tirage photographique",up-cosmos-Inv.I.954,"Bibliothèque de l'Observatoire de Paris, Inv.I.954",1897,,,,,,,"Bibliothèque de l'Observatoire de Paris",,,,"Voir la notice complète dans <a href=""https://cosmos.obspm.fr/index.php/Detail/objects/31675"">Cosmos</a>",,,,,,,,,,,,,,,,,,,,,,,"19e siècle",,,,,,,,,,,,,,,,,,,,,,,,,,,,,,,,,,,,,,,,,,,,,,,,,,,,,,,,,,,,,,,,,,,,Nébuleuses,https://bibnum.obspm.fr/files/original/aaf63afb81ba4c55e51685a73a35d430.jpg,Image,"Collection d'images : Observations astronomiques",1,0
"Région d'Orion : nébuleuse et baudrier ce qu'on en voit à l'œil nu (titre forgé)",,inconnu,Nébuleuses,"Contretype d'une épreuve photographique",,,,,,Négatif,up-FR751142302-AB002591,"Bibliothèque de l'Observatoire de Paris, B410",s.d.,,,,,,,"Bibliothèque de l'Observatoire de Paris",,,,"Voir la notice complète dans <a href='http://www.calames.abes.fr/pub/obs.aspx' target='_blank'>Calames</a>",,,,,,,,,,,,,,,,,,,,,,,"20e siècle",,,,,,,,,,,,,,,,,,,,,,,,,,,,,,,,,,,,,,,,,,,,,,,,,,,,,,,,,,,,,,,,,,,,Nébuleuses,https://bibnum.obspm.fr/files/original/cba979f76fa470f8d8873681e2fdb8a9.jpg,Image,"Collection d'images : Observations astronomiques",1,0
"Spectre de la nébuleuse d'Orion ? (titre forgé)",,inconnu,Nébuleuses,,,,,,,"Tirage photographique","up-cosmos-Inv.I.1666 (5)","Bibliothèque de l'Observatoire de Paris, Inv.I.1666 (5)",1956,,,,,,,"Bibliothèque de l'Observatoire de Paris",,,,"Voir la notice complète dans <a href=""https://cosmos.obspm.fr/index.php/Detail/objects/32572"">Cosmos</a>",,,,,,,,,,,,,,,,,,,,,,,"20e siècle",,,,,,,,,,,,,,,,,,,,,,,,,,,,,,,,,,,,,,,,,,,,,,,,,,,,,,,,,,,,,,,,,,,,"Nébuleuses,Spectres","https://bibnum.obspm.fr/files/original/821989f122c629290b6f6cd5c8b9b80d.jpg,https://bibnum.obspm.fr/files/original/9b0192963e9f03dcbd3107584189604c.jpg",Image,"Collection d'images : Observations astronomiques",1,0
"Spectre de la nébuleuse d'Orion (titre forgé), Orion Nebula 2m 50pr (titre original)",,inconnu,Nébuleuses,,,,,,,"Tirage photographique","up-cosmos-Inv.I.1666 (1)","Bibliothèque de l'Observatoire de Paris, Inv.I.1666 (1)",1956,,,,,,,"Bibliothèque de l'Observatoire de Paris",,,,"Voir la notice complète dans <a href=""https://cosmos.obspm.fr/index.php/Detail/objects/32568"">Cosmos</a>",,,,,,,,,,,,,,,,,,,,,,,"20e siècle",,,,,,,,,,,,,,,,,,,,,,,,,,,,,,,,,,,,,,,,,,,,,,,,,,,,,,,,,,,,,,,,,,,,Nébuleuses,"https://bibnum.obspm.fr/files/original/eee465906c3b0b6faca20aa4b62856b7.jpg,https://bibnum.obspm.fr/files/original/5d6b814e3b1090467911299e46649dca.jpg",Image,"Collection d'images : Observations astronomiques",1,0
"Spectre de la nébuleuse d'Orion. Télescope électronique Lallemand - Cliché Observatoire de Haute-Provence (titre forgé)",,inconnu,Nébuleuses,"Contretype d'une épreuve photographique",,,,,,Négatif,up-FR751142302-AB007681,"Bibliothèque de l'Observatoire de Paris, B1368",s.d.,,,,,,,"Bibliothèque de l'Observatoire de Paris",,,,"Voir la notice complète dans <a href='http://www.calames.abes.fr/pub/obs.aspx' target='_blank'>Calames</a>",,,,,,,,,,,,,,,,,,,,,,,"20e siècle",,,,,,,,,,,,,,,,,,,,,,,,,,,,,,,,,,,,,,,,,,,,,,,,,,,,,,,,,,,,,,,,,,,,"Nébuleuses,Spectres",https://bibnum.obspm.fr/files/original/ce6a256d19518deb7015c2a3de58da89.jpg,Image,"Collection d'images : Observations astronomiques",1,0