﻿"Dublin Core:Title","Dublin Core:Titre alternatif","Dublin Core:Creator","Dublin Core:Subject","Dublin Core:Description","Dublin Core:Publisher","Dublin Core:Contributor","Dublin Core:Format","Dublin Core:Extent","Dublin Core:Medium","Dublin Core:Type","Dublin Core:Identifier","Dublin Core:Source","Dublin Core:Date","Dublin Core:Language","Dublin Core:Is Part Of","Dublin Core:Has Version","Dublin Core:Coverage","Dublin Core:Provenance","Dublin Core:Rights Holder","Dublin Core:Rights","Dublin Core:Abstract","Dublin Core:Table Of Contents","Dublin Core:Date Available","Dublin Core:Relation","Dublin Core:Date Accepted","Dublin Core:Date Copyrighted","Dublin Core:Date Submitted","Dublin Core:Date Created","Dublin Core:Date Issued","Dublin Core:Date Modified","Dublin Core:Date Valid","Dublin Core:Access Rights","Dublin Core:License","Dublin Core:Conforms To","Dublin Core:Has Format","Dublin Core:Has Part","Dublin Core:Is Format Of","Dublin Core:Is Referenced By","Dublin Core:Is Replaced By","Dublin Core:Is Required By","Dublin Core:Is Version Of","Dublin Core:References","Dublin Core:Replaces","Dublin Core:Requires","Dublin Core:Bibliographic Citation","Dublin Core:Spatial Coverage","Dublin Core:Temporal Coverage","Dublin Core:Accrual Method","Dublin Core:Accrual Periodicity","Dublin Core:Accrual Policy","Dublin Core:Audience","Dublin Core:Audience Education Level","Dublin Core:Mediator","Dublin Core:Instructional Method","Item Type Metadata:Text","Item Type Metadata:Interviewer","Item Type Metadata:Interviewee","Item Type Metadata:Location","Item Type Metadata:Transcription","Item Type Metadata:Local URL","Item Type Metadata:Original Format","Item Type Metadata:Physical Dimensions","Item Type Metadata:Duration","Item Type Metadata:Compression","Item Type Metadata:Producer","Item Type Metadata:Director","Item Type Metadata:Bit Rate/Frequency","Item Type Metadata:Time Summary","Item Type Metadata:Email Body","Item Type Metadata:Subject Line","Item Type Metadata:From","Item Type Metadata:To","Item Type Metadata:CC","Item Type Metadata:BCC","Item Type Metadata:Number of Attachments","Item Type Metadata:Standards","Item Type Metadata:Objectives","Item Type Metadata:Materials","Item Type Metadata:Lesson Plan Text","Item Type Metadata:URL","Item Type Metadata:Event Type","Item Type Metadata:Participants","Item Type Metadata:Birth Date","Item Type Metadata:Birthplace","Item Type Metadata:Death Date","Item Type Metadata:Occupation","Item Type Metadata:Biographical Text","Item Type Metadata:Bibliography","Item Type Metadata:Edition Statement","Item Type Metadata:Publication Statement","Item Type Metadata:Note statement","Item Type Metadata:Profile description : Creation","Item Type Metadata:Profile description : Descriptive Rules","Item Type Metadata:Profile description : Language Usage","Item Type Metadata:Revision Description : Change","Item Type Metadata:Revision Description : List","Item Type Metadata:Front matter : Title page","Item Type Metadata:Front matter : Division","Item Type Metadata:Player","Visiteur Elements:Dites des choses","PDF Text:Text","EAD Archive:Descriptive Identification : Heading","EAD Archive:Descriptive Identification : Note","EAD Archive:Appraisal Information","EAD Archive:Arrangement","EAD Archive:Biography or History","EAD Archive:Index","EAD Archive:Level","EAD Archive:Note","EAD Archive:Other Descriptive Data","EAD Archive:Processing Information","EAD Archive:Scope and Content","EAD Archive:Heading","EAD Archive:Table Head",tags,file,itemType,collection,public,featured
"Lettre de Christian Otter à Jan Heweliusz, Kaliningrad, 22 octobre 1649",,"Otter, Christian (1598-1660)",,,,"Heweliusz, Jan (1611-1687)",,,,Manuscrit,up-FR75114302-I002031,"Bibliothèque de l'Observatoire de Paris, C1/1-173",1649-10-22,,"C1/1-16 Correspondance de Johannes Hevelius",,,,,"Bibliothèque de l'Observatoire de Paris",,,,"Voir la notice complète dans <a href=""http://www.calames.abes.fr/pub/obs.aspx"" target=""_blank"">Calames</a>",,,,,,,,,,,,,,,,,,,,,,,"17e siècle",,,,,,,,,,,,,,,,,,,,,,,,,,,,,,,,,,,,,,,,,,,,,,,,,,,,,,,,,,,,,,,,,,,,,"https://bibnum.obspm.fr/files/original/825de447b025119f9dd5d75b739540ba.jpg,https://bibnum.obspm.fr/files/original/6ba56df8154c5ce1e706f65cbcb4c2e9.jpg",Texte,"C1/1 - Correspondance de Johannes Hevelius, volume 1 [1630-1651]",1,0
"Lettre de Christian Otter à Jan Heweliusz, Kaliningrad, 14 novembre 1648",,"Otter, Christian (1598-1660)",,,,"Heweliusz, Jan (1611-1687)",,,,Manuscrit,up-FR75114302-I001941,"Bibliothèque de l'Observatoire de Paris, C1/1-164",1648-11-14,,"C1/1-16 Correspondance de Johannes Hevelius",,,,,"Bibliothèque de l'Observatoire de Paris",,,,"Voir la notice complète dans <a href=""http://www.calames.abes.fr/pub/obs.aspx"" target=""_blank"">Calames</a>",,,,,,,,,,,,,,,,,,,,,,,"17e siècle",,,,,,,,,,,,,,,,,,,,,,,,,,,,,,,,,,,,,,,,,,,,,,,,,,,,,,,,,,,,,,,,,,,,,"https://bibnum.obspm.fr/files/original/28acf4ebf03f27f53b050a99c1a9e8ee.jpg,https://bibnum.obspm.fr/files/original/4a4cdfbfce6a0cf0863be9583e894c64.jpg",Texte,"C1/1 - Correspondance de Johannes Hevelius, volume 1 [1630-1651]",1,0
"Lettre de Christian Otter à Jan Heweliusz, Utrecht, 20 novembre 1644",,"Otter, Christian (1598-1660)",,,,"Heweliusz, Jan (1611-1687)",,,,Manuscrit,up-FR75114302-I000771,"Bibliothèque de l'Observatoire de Paris, C1/1-46",1644-11-20,,"C1/1-16 Correspondance de Johannes Hevelius",,,,,"Bibliothèque de l'Observatoire de Paris",,,,"Voir la notice complète dans <a href=""http://www.calames.abes.fr/pub/obs.aspx"" target=""_blank"">Calames</a>",,,,,,,,,,,,,,,,,,,,,,,"17e siècle",,,,,,,,,,,,,,,,,,,,,,,,,,,,,,,,,,,,,,,,,,,,,,,,,,,,,,,,,,,,,,,,,,,,,"https://bibnum.obspm.fr/files/original/faa8a2df277f8c9eaa0ee118f18a45a3.jpg,https://bibnum.obspm.fr/files/original/a53cd65f4fc61cf091d904366a01f72e.jpg,https://bibnum.obspm.fr/files/original/8cbb58b6cc2fd9c066c29cdc866fd845.jpg,https://bibnum.obspm.fr/files/original/bc86d2fae00dd7dc90df91714cfd1dba.jpg",Texte,"C1/1 - Correspondance de Johannes Hevelius, volume 1 [1630-1651]",1,0
"Lettre de Christian Otter à Jan Heweliusz, Kaliningrad, 4 août 1651",,"Otter, Christian (1598-1660)",,,,"Heweliusz, Jan (1611-1687)",,,,Manuscrit,up-FR75114302-I002861,"Bibliothèque de l'Observatoire de Paris, C1/2-73",1651-08-04,,"C1/1-16 Correspondance de Johannes Hevelius",,,,,"Bibliothèque de l'Observatoire de Paris",,,,"Voir la notice complète dans <a href=""http://www.calames.abes.fr/pub/obs.aspx"" target=""_blank"">Calames</a>",,,,,,,,,,,,,,,,,,,,,,,"17e siècle",,,,,,,,,,,,,,,,,,,,,,,,,,,,,,,,,,,,,,,,,,,,,,,,,,,,,,,,,,,,,,,,,,,,,"https://bibnum.obspm.fr/files/original/ab1c479a9de177ff92eb26f57e9334fd.jpg,https://bibnum.obspm.fr/files/original/e4f5544eeaee1f6d357be51bb38567d2.jpg",Texte,"C1/2 - Correspondance de Johannes Hevelius, volume 2 [1645-1652]",1,0
"Dessin de Christian Otter, 1651",,"Otter, Christian (1598-1660)",,,,,,,,Manuscrit,up-FR75114302-I002851,"Bibliothèque de l'Observatoire de Paris, C1/2-72",1651-01-01/1651-12-31,,"C1/1-16 Correspondance de Johannes Hevelius",,,,,"Bibliothèque de l'Observatoire de Paris",,,,"Voir la notice complète dans <a href=""http://www.calames.abes.fr/pub/obs.aspx"" target=""_blank"">Calames</a>",,,,,,,,,,,,,,,,,,,,,,,"17e siècle",,,,,,,,,,,,,,,,,,,,,,,,,,,,,,,,,,,,,,,,,,,,,,,,,,,,,,,,,,,,,,,,,,,,,"https://bibnum.obspm.fr/files/original/aa146f77c18f89f035cef69b33bb3a70.jpg,https://bibnum.obspm.fr/files/original/3851620a5b14a263b9e6b2e61d58a6b2.jpg",Texte,"C1/2 - Correspondance de Johannes Hevelius, volume 2 [1645-1652]",1,0
"Lettre de Christian Otter à Jan Heweliusz, Kaliningrad, 1er mars 1651",,"Otter, Christian (1598-1660)",,,,"Heweliusz, Jan (1611-1687)",,,,Manuscrit,up-FR75114302-I002841,"Bibliothèque de l'Observatoire de Paris, C1/2-71",1651-03-01,,"C1/1-16 Correspondance de Johannes Hevelius",,,,,"Bibliothèque de l'Observatoire de Paris",,,,"Voir la notice complète dans <a href=""http://www.calames.abes.fr/pub/obs.aspx"" target=""_blank"">Calames</a>",,,,,,,,,,,,,,,,,,,,,,,"17e siècle",,,,,,,,,,,,,,,,,,,,,,,,,,,,,,,,,,,,,,,,,,,,,,,,,,,,,,,,,,,,,,,,,,,,,"https://bibnum.obspm.fr/files/original/1223a54ecf630599eec8b889db09845a.jpg,https://bibnum.obspm.fr/files/original/f55eeb65c1dc5a52bbd6a658c547be84.jpg",Texte,"C1/2 - Correspondance de Johannes Hevelius, volume 2 [1645-1652]",1,0
"Lettre de Christian Otter à Jan Heweliusz, Kaliningrad, 3 septembre 1650",,"Otter, Christian (1598-1660)",,,,"Heweliusz, Jan (1611-1687)",,,,Manuscrit,up-FR75114302-I002601,"Bibliothèque de l'Observatoire de Paris, C1/2-47",1650-09-03,,"C1/1-16 Correspondance de Johannes Hevelius",,,,,"Bibliothèque de l'Observatoire de Paris",,,,"Voir la notice complète dans <a href=""http://www.calames.abes.fr/pub/obs.aspx"" target=""_blank"">Calames</a>",,,,,,,,,,,,,,,,,,,,,,,"17e siècle",,,,,,,,,,,,,,,,,,,,,,,,,,,,,,,,,,,,,,,,,,,,,,,,,,,,,,,,,,,,,,,,,,,,,"https://bibnum.obspm.fr/files/original/b7f542714047c3b7b8fd24dd3d953d2c.jpg,https://bibnum.obspm.fr/files/original/1ce16dab1f22542890190ac0a333e205.jpg",Texte,"C1/2 - Correspondance de Johannes Hevelius, volume 2 [1645-1652]",1,0
"Lettre de Christian Otter à Jan Heweliusz, Kaliningrad, 1er mars 1650",,"Otter, Christian (1598-1660)",,,,"Heweliusz, Jan (1611-1687)",,,,Manuscrit,up-FR75114302-I002501,"Bibliothèque de l'Observatoire de Paris, C1/2-37",1650-03-01,,"C1/1-16 Correspondance de Johannes Hevelius",,,,,"Bibliothèque de l'Observatoire de Paris",,,,"Voir la notice complète dans <a href=""http://www.calames.abes.fr/pub/obs.aspx"" target=""_blank"">Calames</a>",,,,,,,,,,,,,,,,,,,,,,,"17e siècle",,,,,,,,,,,,,,,,,,,,,,,,,,,,,,,,,,,,,,,,,,,,,,,,,,,,,,,,,,,,,,,,,,,,,"https://bibnum.obspm.fr/files/original/6b41d9577f713961cc34ea1556de5436.jpg,https://bibnum.obspm.fr/files/original/48f2a865cca995b8c489f778327a11aa.jpg",Texte,"C1/2 - Correspondance de Johannes Hevelius, volume 2 [1645-1652]",1,0
"Dessin de Christian Otter, Kaliningrad, 10 septembre 1656",,"Otter, Christian (1598-1660)",,,,,,,,Manuscrit,up-FR75114302-I005291,"Bibliothèque de l'Observatoire de Paris, C1/4-18",1656-09-10,,"C1/1-16 Correspondance de Johannes Hevelius",,,,,"Bibliothèque de l'Observatoire de Paris",,,,"Voir la notice complète dans <a href=""http://www.calames.abes.fr/pub/obs.aspx"" target=""_blank"">Calames</a>",,,,,,,,,,,,,,,,,,,,,,,"17e siècle",,,,,,,,,,,,,,,,,,,,,,,,,,,,,,,,,,,,,,,,,,,,,,,,,,,,,,,,,,,,,,,,,,,,,"https://bibnum.obspm.fr/files/original/0c700852327b29c011dff912ef66ea60.jpg,https://bibnum.obspm.fr/files/original/5ab1fc74a7c26a6a867759d71f0f66e3.jpg",Texte,"C1/4 - Correspondance de Johannes Hevelius, volume 4 [1653-1664]",1,0
"Lettre de Christian Otter à Jan Heweliusz, Kaliningrad, 10 septembre 1656",,"Otter, Christian (1598-1660)",,,,"Heweliusz, Jan (1611-1687)",,,,Manuscrit,up-FR75114302-I005281,"Bibliothèque de l'Observatoire de Paris, C1/4-17",1656-09-10,,"C1/1-16 Correspondance de Johannes Hevelius",,,,,"Bibliothèque de l'Observatoire de Paris",,,,"Voir la notice complète dans <a href=""http://www.calames.abes.fr/pub/obs.aspx"" target=""_blank"">Calames</a>",,,,,,,,,,,,,,,,,,,,,,,"17e siècle",,,,,,,,,,,,,,,,,,,,,,,,,,,,,,,,,,,,,,,,,,,,,,,,,,,,,,,,,,,,,,,,,,,,,"https://bibnum.obspm.fr/files/original/86c317c056fab86f1d5b989a43172a60.jpg,https://bibnum.obspm.fr/files/original/97cc54330454620996b69bc49bdf24c6.jpg,https://bibnum.obspm.fr/files/original/4861c43c88dfd89c62a589d2a93e55fb.jpg,https://bibnum.obspm.fr/files/original/94777dd35b2e53692ba1167afd8a4e6f.jpg",Texte,"C1/4 - Correspondance de Johannes Hevelius, volume 4 [1653-1664]",1,0
