﻿"Dublin Core:Title","Dublin Core:Titre alternatif","Dublin Core:Creator","Dublin Core:Subject","Dublin Core:Description","Dublin Core:Publisher","Dublin Core:Contributor","Dublin Core:Format","Dublin Core:Extent","Dublin Core:Medium","Dublin Core:Type","Dublin Core:Identifier","Dublin Core:Source","Dublin Core:Date","Dublin Core:Language","Dublin Core:Is Part Of","Dublin Core:Has Version","Dublin Core:Coverage","Dublin Core:Provenance","Dublin Core:Rights Holder","Dublin Core:Rights","Dublin Core:Abstract","Dublin Core:Table Of Contents","Dublin Core:Date Available","Dublin Core:Relation","Dublin Core:Date Accepted","Dublin Core:Date Copyrighted","Dublin Core:Date Submitted","Dublin Core:Date Created","Dublin Core:Date Issued","Dublin Core:Date Modified","Dublin Core:Date Valid","Dublin Core:Access Rights","Dublin Core:License","Dublin Core:Conforms To","Dublin Core:Has Format","Dublin Core:Has Part","Dublin Core:Is Format Of","Dublin Core:Is Referenced By","Dublin Core:Is Replaced By","Dublin Core:Is Required By","Dublin Core:Is Version Of","Dublin Core:References","Dublin Core:Replaces","Dublin Core:Requires","Dublin Core:Bibliographic Citation","Dublin Core:Spatial Coverage","Dublin Core:Temporal Coverage","Dublin Core:Accrual Method","Dublin Core:Accrual Periodicity","Dublin Core:Accrual Policy","Dublin Core:Audience","Dublin Core:Audience Education Level","Dublin Core:Mediator","Dublin Core:Instructional Method","Item Type Metadata:Text","Item Type Metadata:Interviewer","Item Type Metadata:Interviewee","Item Type Metadata:Location","Item Type Metadata:Transcription","Item Type Metadata:Local URL","Item Type Metadata:Original Format","Item Type Metadata:Physical Dimensions","Item Type Metadata:Duration","Item Type Metadata:Compression","Item Type Metadata:Producer","Item Type Metadata:Director","Item Type Metadata:Bit Rate/Frequency","Item Type Metadata:Time Summary","Item Type Metadata:Email Body","Item Type Metadata:Subject Line","Item Type Metadata:From","Item Type Metadata:To","Item Type Metadata:CC","Item Type Metadata:BCC","Item Type Metadata:Number of Attachments","Item Type Metadata:Standards","Item Type Metadata:Objectives","Item Type Metadata:Materials","Item Type Metadata:Lesson Plan Text","Item Type Metadata:URL","Item Type Metadata:Event Type","Item Type Metadata:Participants","Item Type Metadata:Birth Date","Item Type Metadata:Birthplace","Item Type Metadata:Death Date","Item Type Metadata:Occupation","Item Type Metadata:Biographical Text","Item Type Metadata:Bibliography","Item Type Metadata:Edition Statement","Item Type Metadata:Publication Statement","Item Type Metadata:Note statement","Item Type Metadata:Profile description : Creation","Item Type Metadata:Profile description : Descriptive Rules","Item Type Metadata:Profile description : Language Usage","Item Type Metadata:Revision Description : Change","Item Type Metadata:Revision Description : List","Item Type Metadata:Front matter : Title page","Item Type Metadata:Front matter : Division","Item Type Metadata:Player","Visiteur Elements:Dites des choses","PDF Text:Text","EAD Archive:Descriptive Identification : Heading","EAD Archive:Descriptive Identification : Note","EAD Archive:Appraisal Information","EAD Archive:Arrangement","EAD Archive:Biography or History","EAD Archive:Index","EAD Archive:Level","EAD Archive:Note","EAD Archive:Other Descriptive Data","EAD Archive:Processing Information","EAD Archive:Scope and Content","EAD Archive:Heading","EAD Archive:Table Head",tags,file,itemType,collection,public,featured
"Lettre d'Albert Linemann à Jan Heweliusz, Kaliningrad, 28 août 1652",,"Linemann, Albert (1603-1653)",,,,"Heweliusz, Jan (1611-1687)",,,,Manuscrit,up-FR75114302-I003741,"Bibliothèque de l'Observatoire de Paris, C1/3-3",1652-08-28,,"C1/1-16 Correspondance de Johannes Hevelius",,,,,"Bibliothèque de l'Observatoire de Paris",,,,"Voir la notice complète dans <a href=""http://www.calames.abes.fr/pub/obs.aspx"" target=""_blank"">Calames</a>",,,,,,,,,,,,,,,,,,,,,,,"17e siècle",,,,,,,,,,,,,,,,,,,,,,,,,,,,,,,,,,,,,,,,,,,,,,,,,,,,,,,,,,,,,,,,,,,,,"https://bibnum.obspm.fr/files/original/af2bc433ba4ee34903b6de458c09e526.jpg,https://bibnum.obspm.fr/files/original/a7c46e9d78333609209e20a17eb22a30.jpg,https://bibnum.obspm.fr/files/original/e44d8403e879cc39e96cd0507e5465eb.jpg,https://bibnum.obspm.fr/files/original/230fe9dce01a9991918876004b3a5eec.jpg",Texte,"C1/3 - Correspondance de Johannes Hevelius, volume 3 [1652-1656]",1,0
"Lettre d'Albert Linemann à Jan Heweliusz, Kaliningrad, 24 septembre 1652",,"Linemann, Albert (1603-1653)",,,,"Heweliusz, Jan (1611-1687)",,,,Manuscrit,up-FR75114302-I003751,"Bibliothèque de l'Observatoire de Paris, C1/3-4",1652-09-24,,"C1/1-16 Correspondance de Johannes Hevelius",,,,,"Bibliothèque de l'Observatoire de Paris",,,,"Voir la notice complète dans <a href=""http://www.calames.abes.fr/pub/obs.aspx"" target=""_blank"">Calames</a>",,,,,,,,,,,,,,,,,,,,,,,"17e siècle",,,,,,,,,,,,,,,,,,,,,,,,,,,,,,,,,,,,,,,,,,,,,,,,,,,,,,,,,,,,,,,,,,,,,"https://bibnum.obspm.fr/files/original/09574f500c7a1750c5c70f650b288d6f.jpg,https://bibnum.obspm.fr/files/original/8ab6691493507f62f871be7f418c67a4.jpg",Texte,"C1/3 - Correspondance de Johannes Hevelius, volume 3 [1652-1656]",1,0
"Lettre d'Albert Linemann à Jan Heweliusz, Kaliningrad, 17 décembre 1652",,"Linemann, Albert (1603-1653)",,,,"Heweliusz, Jan (1611-1687)",,,,Manuscrit,up-FR75114302-I003871,"Bibliothèque de l'Observatoire de Paris, C1/3-16",1652-12-17,,"C1/1-16 Correspondance de Johannes Hevelius",,,,,"Bibliothèque de l'Observatoire de Paris",,,,"Voir la notice complète dans <a href=""http://www.calames.abes.fr/pub/obs.aspx"" target=""_blank"">Calames</a>",,,,,,,,,,,,,,,,,,,,,,,"17e siècle",,,,,,,,,,,,,,,,,,,,,,,,,,,,,,,,,,,,,,,,,,,,,,,,,,,,,,,,,,,,,,,,,,,,,"https://bibnum.obspm.fr/files/original/5d2c162daac954647b304a89f644b043.jpg,https://bibnum.obspm.fr/files/original/98eef517996a2121bf5496e89ba090b4.jpg",Texte,"C1/3 - Correspondance de Johannes Hevelius, volume 3 [1652-1656]",1,0
"Texte manuscrit d'Albert Linemann, Kaliningrad, 8 avril 1652",,"Linemann, Albert (1603-1653)",,,,,,,,Manuscrit,up-FR75114302-I003881,"Bibliothèque de l'Observatoire de Paris, C1/3-17",1652-04-08,,"C1/1-16 Correspondance de Johannes Hevelius",,,,,"Bibliothèque de l'Observatoire de Paris",,,,"Voir la notice complète dans <a href=""http://www.calames.abes.fr/pub/obs.aspx"" target=""_blank"">Calames</a>",,,,,,,,,,,,,,,,,,,,,,,"17e siècle",,,,,,,,,,,,,,,,,,,,,,,,,,,,,,,,,,,,,,,,,,,,,,,,,,,,,,,,,,,,,,,,,,,,,"https://bibnum.obspm.fr/files/original/22bc68e4215f7f6900abc5666af0bd77.jpg,https://bibnum.obspm.fr/files/original/cda95e01eac926bdddfe3bf48b7eb574.jpg",Texte,"C1/3 - Correspondance de Johannes Hevelius, volume 3 [1652-1656]",1,0
"Texte manuscrit d'Albert Linemann, Kaliningrad, 1er janvier - 17 décembre 1652",,"Linemann, Albert (1603-1653)",,,,,,,,Manuscrit,up-FR75114302-I003891,"Bibliothèque de l'Observatoire de Paris, C1/3-18",1652-01-01/1652-12-17,,"C1/1-16 Correspondance de Johannes Hevelius",,,,,"Bibliothèque de l'Observatoire de Paris",,,,"Voir la notice complète dans <a href=""http://www.calames.abes.fr/pub/obs.aspx"" target=""_blank"">Calames</a>",,,,,,,,,,,,,,,,,,,,,,,"17e siècle",,,,,,,,,,,,,,,,,,,,,,,,,,,,,,,,,,,,,,,,,,,,,,,,,,,,,,,,,,,,,,,,,,,,,"https://bibnum.obspm.fr/files/original/b7dc78ec0e8eecab5bdf5877a17eae81.jpg,https://bibnum.obspm.fr/files/original/b2b429aed4aaeb78f32d7077bf112d7b.jpg",Texte,"C1/3 - Correspondance de Johannes Hevelius, volume 3 [1652-1656]",1,0
"Lettre d'Albert Linemann à Jan Heweliusz, Kaliningrad, 13 décembre 1652",,"Linemann, Albert (1603-1653)",,,,"Heweliusz, Jan (1611-1687)",,,,Manuscrit,up-FR75114302-I003901,"Bibliothèque de l'Observatoire de Paris, C1/3-19",1652-12-13,,"C1/1-16 Correspondance de Johannes Hevelius",,,,,"Bibliothèque de l'Observatoire de Paris",,,,"Voir la notice complète dans <a href=""http://www.calames.abes.fr/pub/obs.aspx"" target=""_blank"">Calames</a>",,,,,,,,,,,,,,,,,,,,,,,"17e siècle",,,,,,,,,,,,,,,,,,,,,,,,,,,,,,,,,,,,,,,,,,,,,,,,,,,,,,,,,,,,,,,,,,,,,"https://bibnum.obspm.fr/files/original/65032e70cfb200e09e6769b1269f07a8.jpg,https://bibnum.obspm.fr/files/original/dcaedc5874e88dd71cafa317de4002ac.jpg",Texte,"C1/3 - Correspondance de Johannes Hevelius, volume 3 [1652-1656]",1,0
"Lettre d'Albert Linemann à Jan Heweliusz, Kaliningrad, 13 juin 1653",,"Linemann, Albert (1603-1653)",,,,"Heweliusz, Jan (1611-1687)",,,,Manuscrit,up-FR75114302-I004341,"Bibliothèque de l'Observatoire de Paris, C1/3-63",1653-06-13,,"C1/1-16 Correspondance de Johannes Hevelius",,,,,"Bibliothèque de l'Observatoire de Paris",,,,"Voir la notice complète dans <a href=""http://www.calames.abes.fr/pub/obs.aspx"" target=""_blank"">Calames</a>",,,,,,,,,,,,,,,,,,,,,,,"17e siècle",,,,,,,,,,,,,,,,,,,,,,,,,,,,,,,,,,,,,,,,,,,,,,,,,,,,,,,,,,,,,,,,,,,,,"https://bibnum.obspm.fr/files/original/c47f54d49a600fdba7197e6d03acfd3f.jpg,https://bibnum.obspm.fr/files/original/2bc76f32cc14574984e8bee845b026e1.jpg",Texte,"C1/3 - Correspondance de Johannes Hevelius, volume 3 [1652-1656]",1,0
"Lettre d'Albert Linemann à Jan Heweliusz, Kaliningrad, 3 juin 1650",,"Linemann, Albert (1603-1653)",,,,"Heweliusz, Jan (1611-1687)",,,,Manuscrit,up-FR75114302-I002481,"Bibliothèque de l'Observatoire de Paris, C1/2-35",1650-06-03,,"C1/1-16 Correspondance de Johannes Hevelius",,,,,"Bibliothèque de l'Observatoire de Paris",,,,"Voir la notice complète dans <a href=""http://www.calames.abes.fr/pub/obs.aspx"" target=""_blank"">Calames</a>",,,,,,,,,,,,,,,,,,,,,,,"17e siècle",,,,,,,,,,,,,,,,,,,,,,,,,,,,,,,,,,,,,,,,,,,,,,,,,,,,,,,,,,,,,,,,,,,,,"https://bibnum.obspm.fr/files/original/3b4aa400de8ecdee1c0bf21877b9e0a0.jpg,https://bibnum.obspm.fr/files/original/dd5eb29a4e0e982a729065e55614477c.jpg",Texte,"C1/2 - Correspondance de Johannes Hevelius, volume 2 [1645-1652]",1,0
"Lettre d'Albert Linemann à Jan Heweliusz, Kaliningrad, 11 septembre 1651",,"Linemann, Albert (1603-1653)",,,,"Heweliusz, Jan (1611-1687)",,,,Manuscrit,up-FR75114302-I003071,"Bibliothèque de l'Observatoire de Paris, C1/2-94",1651-09-11,,"C1/1-16 Correspondance de Johannes Hevelius",,,,,"Bibliothèque de l'Observatoire de Paris",,,,"Voir la notice complète dans <a href=""http://www.calames.abes.fr/pub/obs.aspx"" target=""_blank"">Calames</a>",,,,,,,,,,,,,,,,,,,,,,,"17e siècle",,,,,,,,,,,,,,,,,,,,,,,,,,,,,,,,,,,,,,,,,,,,,,,,,,,,,,,,,,,,,,,,,,,,,"https://bibnum.obspm.fr/files/original/244a810da3a81cdf7514632d943164f1.jpg,https://bibnum.obspm.fr/files/original/36eec974aa54f7ab7c69199f0be4a58d.jpg",Texte,"C1/2 - Correspondance de Johannes Hevelius, volume 2 [1645-1652]",1,0
"Lettre d'Albert Linemann à Jan Heweliusz, Kaliningrad, 4 septembre 1651",,"Linemann, Albert (1603-1653)",,,,"Heweliusz, Jan (1611-1687)",,,,Manuscrit,up-FR75114302-I003081,"Bibliothèque de l'Observatoire de Paris, C1/2-95",1651-09-04,,"C1/1-16 Correspondance de Johannes Hevelius",,,,,"Bibliothèque de l'Observatoire de Paris",,,,"Voir la notice complète dans <a href=""http://www.calames.abes.fr/pub/obs.aspx"" target=""_blank"">Calames</a>",,,,,,,,,,,,,,,,,,,,,,,"17e siècle",,,,,,,,,,,,,,,,,,,,,,,,,,,,,,,,,,,,,,,,,,,,,,,,,,,,,,,,,,,,,,,,,,,,,"https://bibnum.obspm.fr/files/original/c48aaa9241e60bed70d8025142124441.jpg,https://bibnum.obspm.fr/files/original/65626e700f078cc5c6fad96c58c4a677.jpg",Texte,"C1/2 - Correspondance de Johannes Hevelius, volume 2 [1645-1652]",1,0
"Texte manuscrit d'Albert Linemann, Kaliningrad, 4 septembre 1651",,"Linemann, Albert (1603-1653)",,,,,,,,Manuscrit,up-FR75114302-I003091,"Bibliothèque de l'Observatoire de Paris, C1/2-96",1651-09-04,,"C1/1-16 Correspondance de Johannes Hevelius",,,,,"Bibliothèque de l'Observatoire de Paris",,,,"Voir la notice complète dans <a href=""http://www.calames.abes.fr/pub/obs.aspx"" target=""_blank"">Calames</a>",,,,,,,,,,,,,,,,,,,,,,,"17e siècle",,,,,,,,,,,,,,,,,,,,,,,,,,,,,,,,,,,,,,,,,,,,,,,,,,,,,,,,,,,,,,,,,,,,,"https://bibnum.obspm.fr/files/original/8f05c72067a6ee53e8be3e60518e6077.jpg,https://bibnum.obspm.fr/files/original/9f53b3cde2a330023babdc78fdf48b8f.jpg",Texte,"C1/2 - Correspondance de Johannes Hevelius, volume 2 [1645-1652]",1,0
"Lettre d'Albert Linemann à Abraham von Franckenberg, Kaliningrad, 9 janvier 1645",,"Linemann, Albert (1603-1653)",,,,"Franckenberg, Abraham von (1593-1652)",,,,Manuscrit,up-FR75114302-I003411,"Bibliothèque de l'Observatoire de Paris, C1/2-128",1645-01-09,,"C1/1-16 Correspondance de Johannes Hevelius",,,,,"Bibliothèque de l'Observatoire de Paris",,,,"Voir la notice complète dans <a href=""http://www.calames.abes.fr/pub/obs.aspx"" target=""_blank"">Calames</a>",,,,,,,,,,,,,,,,,,,,,,,"17e siècle",,,,,,,,,,,,,,,,,,,,,,,,,,,,,,,,,,,,,,,,,,,,,,,,,,,,,,,,,,,,,,,,,,,,,"https://bibnum.obspm.fr/files/original/595acfdf79b564de2981657e759e2afe.jpg,https://bibnum.obspm.fr/files/original/d8ca9529fe0e4ca29c742d56a68b882c.jpg",Texte,"C1/2 - Correspondance de Johannes Hevelius, volume 2 [1645-1652]",1,0
"Lettre d'Albert Linemann à Jan Heweliusz, Kaliningrad, 28 janvier 1652",,"Linemann, Albert (1603-1653)",,,,"Heweliusz, Jan (1611-1687)",,,,Manuscrit,up-FR75114302-I003421,"Bibliothèque de l'Observatoire de Paris, C1/2-129",1652-01-28,,"C1/1-16 Correspondance de Johannes Hevelius",,,,,"Bibliothèque de l'Observatoire de Paris",,,,"Voir la notice complète dans <a href=""http://www.calames.abes.fr/pub/obs.aspx"" target=""_blank"">Calames</a>",,,,,,,,,,,,,,,,,,,,,,,"17e siècle",,,,,,,,,,,,,,,,,,,,,,,,,,,,,,,,,,,,,,,,,,,,,,,,,,,,,,,,,,,,,,,,,,,,,"https://bibnum.obspm.fr/files/original/be56dc9d86388d2bb43e15f5feb84bf6.jpg,https://bibnum.obspm.fr/files/original/16d8528eaa7cb3908d82db8cc4c996b9.jpg",Texte,"C1/2 - Correspondance de Johannes Hevelius, volume 2 [1645-1652]",1,0
"Lettre d'Albert Linemann à Jan Heweliusz, Kaliningrad, 24 avril 1652",,"Linemann, Albert (1603-1653)",,,,"Heweliusz, Jan (1611-1687)",,,,Manuscrit,up-FR75114302-I003461,"Bibliothèque de l'Observatoire de Paris, C1/2-133",1652-04-24,,"C1/1-16 Correspondance de Johannes Hevelius",,,,,"Bibliothèque de l'Observatoire de Paris",,,,"Voir la notice complète dans <a href=""http://www.calames.abes.fr/pub/obs.aspx"" target=""_blank"">Calames</a>",,,,,,,,,,,,,,,,,,,,,,,"17e siècle",,,,,,,,,,,,,,,,,,,,,,,,,,,,,,,,,,,,,,,,,,,,,,,,,,,,,,,,,,,,,,,,,,,,,"https://bibnum.obspm.fr/files/original/ff8a7940f9752cbe2df1b2f6b5d65de3.jpg,https://bibnum.obspm.fr/files/original/ee6ed14489b259a528b01be473a48610.jpg",Texte,"C1/2 - Correspondance de Johannes Hevelius, volume 2 [1645-1652]",1,0
"Lettre d'Albert Linemann à Jan Heweliusz, Kaliningrad, 9 avril 1652",,"Linemann, Albert (1603-1653)",,,,"Heweliusz, Jan (1611-1687)",,,,Manuscrit,up-FR75114302-I003471,"Bibliothèque de l'Observatoire de Paris, C1/2-134",1652-04-09,,"C1/1-16 Correspondance de Johannes Hevelius",,,,,"Bibliothèque de l'Observatoire de Paris",,,,"Voir la notice complète dans <a href=""http://www.calames.abes.fr/pub/obs.aspx"" target=""_blank"">Calames</a>",,,,,,,,,,,,,,,,,,,,,,,"17e siècle",,,,,,,,,,,,,,,,,,,,,,,,,,,,,,,,,,,,,,,,,,,,,,,,,,,,,,,,,,,,,,,,,,,,,"https://bibnum.obspm.fr/files/original/bad676e8aeba85b6bfabc187b681454e.jpg,https://bibnum.obspm.fr/files/original/d240359dd64feb5b819913a1f38a9966.jpg",Texte,"C1/2 - Correspondance de Johannes Hevelius, volume 2 [1645-1652]",1,0
"Lettre d'Albert Linemann à Jan Heweliusz, Kaliningrad, 20 juin 1652",,"Linemann, Albert (1603-1653)",,,,"Heweliusz, Jan (1611-1687)",,,,Manuscrit,up-FR75114302-I003481,"Bibliothèque de l'Observatoire de Paris, C1/2-135",1652-06-20,,"C1/1-16 Correspondance de Johannes Hevelius",,,,,"Bibliothèque de l'Observatoire de Paris",,,,"Voir la notice complète dans <a href=""http://www.calames.abes.fr/pub/obs.aspx"" target=""_blank"">Calames</a>",,,,,,,,,,,,,,,,,,,,,,,"17e siècle",,,,,,,,,,,,,,,,,,,,,,,,,,,,,,,,,,,,,,,,,,,,,,,,,,,,,,,,,,,,,,,,,,,,,"https://bibnum.obspm.fr/files/original/5aaffec714c654dfc14fb5ac2ec8cbce.jpg,https://bibnum.obspm.fr/files/original/a77c1be4108ae30580d8ddb4d5113645.jpg,https://bibnum.obspm.fr/files/original/9aec6e19028ad18b0a374905b469d795.jpg,https://bibnum.obspm.fr/files/original/91c7982b15a14a278eb20314d8f6fb33.jpg",Texte,"C1/2 - Correspondance de Johannes Hevelius, volume 2 [1645-1652]",1,0
"Lettre d'Albert Linemann à Jan Heweliusz, Kaliningrad, 16 mars 1643",,"Linemann, Albert (1603-1653)",,,,"Heweliusz, Jan (1611-1687)",,,,Manuscrit,up-FR75114302-I000221,"Bibliothèque de l'Observatoire de Paris, C1/1-21",1643-03-16,,"C1/1-16 Correspondance de Johannes Hevelius",,,,,"Bibliothèque de l'Observatoire de Paris",,,,"Voir la notice complète dans <a href=""http://www.calames.abes.fr/pub/obs.aspx"" target=""_blank"">Calames</a>",,,,,,,,,,,,,,,,,,,,,,,"17e siècle",,,,,,,,,,,,,,,,,,,,,,,,,,,,,,,,,,,,,,,,,,,,,,,,,,,,,,,,,,,,,,,,,,,,,"https://bibnum.obspm.fr/files/original/f471d4d503b07fe500fca6f918cb43ce.jpg,https://bibnum.obspm.fr/files/original/bfd1fd6598eebf91d71dc065970eae3f.jpg",Texte,"C1/1 - Correspondance de Johannes Hevelius, volume 1 [1630-1651]",1,0
"Lettre d'Albert Linemann à Jan Heweliusz, Kaliningrad, 18 avril 1643",,"Linemann, Albert (1603-1653)",,,,"Heweliusz, Jan (1611-1687)",,,,Manuscrit,up-FR75114302-I000231,"Bibliothèque de l'Observatoire de Paris, C1/1-22",1643-04-18,,"C1/1-16 Correspondance de Johannes Hevelius",,,,,"Bibliothèque de l'Observatoire de Paris",,,,"Voir la notice complète dans <a href=""http://www.calames.abes.fr/pub/obs.aspx"" target=""_blank"">Calames</a>",,,,,,,,,,,,,,,,,,,,,,,"17e siècle",,,,,,,,,,,,,,,,,,,,,,,,,,,,,,,,,,,,,,,,,,,,,,,,,,,,,,,,,,,,,,,,,,,,,"https://bibnum.obspm.fr/files/original/4078dcf5c622f9c0ab9da721e83050ba.jpg,https://bibnum.obspm.fr/files/original/4944ae8783a3000cbd0d8352d2594b43.jpg",Texte,"C1/1 - Correspondance de Johannes Hevelius, volume 1 [1630-1651]",1,0
"Lettre d'Albert Linemann à Jan Heweliusz, Kaliningrad, 10 janvier 1644",,"Linemann, Albert (1603-1653)",,,,"Heweliusz, Jan (1611-1687)",,,,Manuscrit,up-FR75114302-I000241,"Bibliothèque de l'Observatoire de Paris, C1/1-23",1644-01-10,,"C1/1-16 Correspondance de Johannes Hevelius",,,,,"Bibliothèque de l'Observatoire de Paris",,,,"Voir la notice complète dans <a href=""http://www.calames.abes.fr/pub/obs.aspx"" target=""_blank"">Calames</a>",,,,,,,,,,,,,,,,,,,,,,,"17e siècle",,,,,,,,,,,,,,,,,,,,,,,,,,,,,,,,,,,,,,,,,,,,,,,,,,,,,,,,,,,,,,,,,,,,,"https://bibnum.obspm.fr/files/original/e8f39dcfdb5e960b3b37c9d4403b3ef9.jpg,https://bibnum.obspm.fr/files/original/9eaf588fad6c54e90b969efac90e53ad.jpg",Texte,"C1/1 - Correspondance de Johannes Hevelius, volume 1 [1630-1651]",1,0
"Lettre d'Albert Linemann à Jan Heweliusz, Kaliningrad, 18 octobre 1644",,"Linemann, Albert (1603-1653)",,,,"Heweliusz, Jan (1611-1687)",,,,Manuscrit,up-FR75114302-I000821,"Bibliothèque de l'Observatoire de Paris, C1/1-51",1644-10-18,,"C1/1-16 Correspondance de Johannes Hevelius",,,,,"Bibliothèque de l'Observatoire de Paris",,,,"Voir la notice complète dans <a href=""http://www.calames.abes.fr/pub/obs.aspx"" target=""_blank"">Calames</a>",,,,,,,,,,,,,,,,,,,,,,,"17e siècle",,,,,,,,,,,,,,,,,,,,,,,,,,,,,,,,,,,,,,,,,,,,,,,,,,,,,,,,,,,,,,,,,,,,,"https://bibnum.obspm.fr/files/original/46d071b6365aed8ba7bcc28ee072e38d.jpg,https://bibnum.obspm.fr/files/original/99f4f3e5afe09e382afea36c1a92c81e.jpg",Texte,"C1/1 - Correspondance de Johannes Hevelius, volume 1 [1630-1651]",1,0
"Texte manuscrit d'Albert Linemann",,"Linemann, Albert (1603-1653)",,,,,,,,Manuscrit,up-FR75114302-I000831,"Bibliothèque de l'Observatoire de Paris, C1/1-52",s.d.,,"C1/1-16 Correspondance de Johannes Hevelius",,,,,"Bibliothèque de l'Observatoire de Paris",,,,"Voir la notice complète dans <a href=""http://www.calames.abes.fr/pub/obs.aspx"" target=""_blank"">Calames</a>",,,,,,,,,,,,,,,,,,,,,,,"17e siècle",,,,,,,,,,,,,,,,,,,,,,,,,,,,,,,,,,,,,,,,,,,,,,,,,,,,,,,,,,,,,,,,,,,,,"https://bibnum.obspm.fr/files/original/0256a4568b8b3510cbeb17337b918980.jpg,https://bibnum.obspm.fr/files/original/1b15bb1abc88c0d4d4f78f096dc7f7cf.jpg",Texte,"C1/1 - Correspondance de Johannes Hevelius, volume 1 [1630-1651]",1,0
"Lettre d'Albert Linemann à Jan Heweliusz, Kaliningrad, 6 janvier 1645",,"Linemann, Albert (1603-1653)",,,,"Heweliusz, Jan (1611-1687)",,,,Manuscrit,up-FR75114302-I000841,"Bibliothèque de l'Observatoire de Paris, C1/1-53",1645-01-06,,"C1/1-16 Correspondance de Johannes Hevelius",,,,,"Bibliothèque de l'Observatoire de Paris",,,,"Voir la notice complète dans <a href=""http://www.calames.abes.fr/pub/obs.aspx"" target=""_blank"">Calames</a>",,,,,,,,,,,,,,,,,,,,,,,"17e siècle",,,,,,,,,,,,,,,,,,,,,,,,,,,,,,,,,,,,,,,,,,,,,,,,,,,,,,,,,,,,,,,,,,,,,"https://bibnum.obspm.fr/files/original/61d26a39183d8277382fdc58a50a6c86.jpg,https://bibnum.obspm.fr/files/original/b4135f565ac2c50b2db447661bc31de3.jpg",Texte,"C1/1 - Correspondance de Johannes Hevelius, volume 1 [1630-1651]",1,0
"Lettre d'Albert Linemann à Jan Heweliusz, Kaliningrad, 28 mars 1645",,"Linemann, Albert (1603-1653)",,,,"Heweliusz, Jan (1611-1687)",,,,Manuscrit,up-FR75114302-I000861,"Bibliothèque de l'Observatoire de Paris, C1/1-55",1645-03-28,,"C1/1-16 Correspondance de Johannes Hevelius",,,,,"Bibliothèque de l'Observatoire de Paris",,,,"Voir la notice complète dans <a href=""http://www.calames.abes.fr/pub/obs.aspx"" target=""_blank"">Calames</a>",,,,,,,,,,,,,,,,,,,,,,,"17e siècle",,,,,,,,,,,,,,,,,,,,,,,,,,,,,,,,,,,,,,,,,,,,,,,,,,,,,,,,,,,,,,,,,,,,,"https://bibnum.obspm.fr/files/original/1d48e1f2b2aef240a73121023c52c440.jpg,https://bibnum.obspm.fr/files/original/0e3bd5f5ae967566f27a7ad2857307a7.jpg",Texte,"C1/1 - Correspondance de Johannes Hevelius, volume 1 [1630-1651]",1,0
"Texte manuscrit d'Albert Linemann à Jan Heweliusz, Kaliningrad",,"Linemann, Albert (1603-1653)",,,,"Heweliusz, Jan (1611-1687)",,,,Manuscrit,up-FR75114302-I000871,"Bibliothèque de l'Observatoire de Paris, C1/1-56",s.d.,,"C1/1-16 Correspondance de Johannes Hevelius",,,,,"Bibliothèque de l'Observatoire de Paris",,,,"Voir la notice complète dans <a href=""http://www.calames.abes.fr/pub/obs.aspx"" target=""_blank"">Calames</a>",,,,,,,,,,,,,,,,,,,,,,,"17e siècle",,,,,,,,,,,,,,,,,,,,,,,,,,,,,,,,,,,,,,,,,,,,,,,,,,,,,,,,,,,,,,,,,,,,,"https://bibnum.obspm.fr/files/original/962983c7ac47748576e3c619a38cbc41.jpg,https://bibnum.obspm.fr/files/original/f82ed1223d28f183fb5af5c04f06b13c.jpg",Texte,"C1/1 - Correspondance de Johannes Hevelius, volume 1 [1630-1651]",1,0
"Lettre d'Albert Linemann à Jan Heweliusz, Kaliningrad, 18 avril 1645",,"Linemann, Albert (1603-1653)",,,,"Heweliusz, Jan (1611-1687)",,,,Manuscrit,up-FR75114302-I000881,"Bibliothèque de l'Observatoire de Paris, C1/1-57",1645-04-18,,"C1/1-16 Correspondance de Johannes Hevelius",,,,,"Bibliothèque de l'Observatoire de Paris",,,,"Voir la notice complète dans <a href=""http://www.calames.abes.fr/pub/obs.aspx"" target=""_blank"">Calames</a>",,,,,,,,,,,,,,,,,,,,,,,"17e siècle",,,,,,,,,,,,,,,,,,,,,,,,,,,,,,,,,,,,,,,,,,,,,,,,,,,,,,,,,,,,,,,,,,,,,"https://bibnum.obspm.fr/files/original/fb2151e423d9b16f90039c4611c1cf13.jpg,https://bibnum.obspm.fr/files/original/b68a5be4b97f3145fa4bdb436041cd02.jpg,https://bibnum.obspm.fr/files/original/412dcf026b79ffb9621e65b212050870.jpg,https://bibnum.obspm.fr/files/original/88721399096e7807a26ca46f90108d1b.jpg",Texte,"C1/1 - Correspondance de Johannes Hevelius, volume 1 [1630-1651]",1,0