﻿"Dublin Core:Title","Dublin Core:Titre alternatif","Dublin Core:Creator","Dublin Core:Subject","Dublin Core:Description","Dublin Core:Publisher","Dublin Core:Contributor","Dublin Core:Format","Dublin Core:Extent","Dublin Core:Medium","Dublin Core:Type","Dublin Core:Identifier","Dublin Core:Source","Dublin Core:Date","Dublin Core:Language","Dublin Core:Is Part Of","Dublin Core:Has Version","Dublin Core:Coverage","Dublin Core:Provenance","Dublin Core:Rights Holder","Dublin Core:Rights","Dublin Core:Abstract","Dublin Core:Table Of Contents","Dublin Core:Date Available","Dublin Core:Relation","Dublin Core:Date Accepted","Dublin Core:Date Copyrighted","Dublin Core:Date Submitted","Dublin Core:Date Created","Dublin Core:Date Issued","Dublin Core:Date Modified","Dublin Core:Date Valid","Dublin Core:Access Rights","Dublin Core:License","Dublin Core:Conforms To","Dublin Core:Has Format","Dublin Core:Has Part","Dublin Core:Is Format Of","Dublin Core:Is Referenced By","Dublin Core:Is Replaced By","Dublin Core:Is Required By","Dublin Core:Is Version Of","Dublin Core:References","Dublin Core:Replaces","Dublin Core:Requires","Dublin Core:Bibliographic Citation","Dublin Core:Spatial Coverage","Dublin Core:Temporal Coverage","Dublin Core:Accrual Method","Dublin Core:Accrual Periodicity","Dublin Core:Accrual Policy","Dublin Core:Audience","Dublin Core:Audience Education Level","Dublin Core:Mediator","Dublin Core:Instructional Method","Item Type Metadata:Text","Item Type Metadata:Interviewer","Item Type Metadata:Interviewee","Item Type Metadata:Location","Item Type Metadata:Transcription","Item Type Metadata:Local URL","Item Type Metadata:Original Format","Item Type Metadata:Physical Dimensions","Item Type Metadata:Duration","Item Type Metadata:Compression","Item Type Metadata:Producer","Item Type Metadata:Director","Item Type Metadata:Bit Rate/Frequency","Item Type Metadata:Time Summary","Item Type Metadata:Email Body","Item Type Metadata:Subject Line","Item Type Metadata:From","Item Type Metadata:To","Item Type Metadata:CC","Item Type Metadata:BCC","Item Type Metadata:Number of Attachments","Item Type Metadata:Standards","Item Type Metadata:Objectives","Item Type Metadata:Materials","Item Type Metadata:Lesson Plan Text","Item Type Metadata:URL","Item Type Metadata:Event Type","Item Type Metadata:Participants","Item Type Metadata:Birth Date","Item Type Metadata:Birthplace","Item Type Metadata:Death Date","Item Type Metadata:Occupation","Item Type Metadata:Biographical Text","Item Type Metadata:Bibliography","Item Type Metadata:Edition Statement","Item Type Metadata:Publication Statement","Item Type Metadata:Note statement","Item Type Metadata:Profile description : Creation","Item Type Metadata:Profile description : Descriptive Rules","Item Type Metadata:Profile description : Language Usage","Item Type Metadata:Revision Description : Change","Item Type Metadata:Revision Description : List","Item Type Metadata:Front matter : Title page","Item Type Metadata:Front matter : Division","Item Type Metadata:Player","Visiteur Elements:Dites des choses","PDF Text:Text","EAD Archive:Descriptive Identification : Heading","EAD Archive:Descriptive Identification : Note","EAD Archive:Appraisal Information","EAD Archive:Arrangement","EAD Archive:Biography or History","EAD Archive:Index","EAD Archive:Level","EAD Archive:Note","EAD Archive:Other Descriptive Data","EAD Archive:Processing Information","EAD Archive:Scope and Content","EAD Archive:Heading","EAD Archive:Table Head",tags,file,itemType,collection,public,featured
"Lettre de Gottfried Kirch à Jan Heweliusz, Leipzig, 5 octobre 1678",,"Kirch, Gottfried (1639-1710)",,,,"Heweliusz, Jan (1611-1687)",,,,Manuscrit,up-FR75114302-I018121,"Bibliothèque de l'Observatoire de Paris, C1/12-117",1678-10-05,,"C1/1-16 Correspondance de Johannes Hevelius",,,,,"Bibliothèque de l'Observatoire de Paris",,,,"Voir la notice complète dans <a href=""http://www.calames.abes.fr/pub/obs.aspx"" target=""_blank"">Calames</a>",,,,,,,,,,,,,,,,,,,,,,,"17e siècle",,,,,,,,,,,,,,,,,,,,,,,,,,,,,,,,,,,,,,,,,,,,,,,,,,,,,,,,,,,,,,,,,,,,,"https://bibnum.obspm.fr/files/original/61cb9c842a03eaf4043d62517d125119.jpg,https://bibnum.obspm.fr/files/original/ebc019620f1e89b7dd166be85e321331.jpg",Texte,"C1/12 - Correspondance de Johannes Hevelius, volume 12 [1675-1678]",1,0
"Texte manuscrit de Gottfried Kirch, 15 octobre 1678",,"Kirch, Gottfried (1639-1710)",,,,,,,,Manuscrit,up-FR75114302-I018101,"Bibliothèque de l'Observatoire de Paris, C1/12-115",1678-10-15,,"C1/1-16 Correspondance de Johannes Hevelius",,,,,"Bibliothèque de l'Observatoire de Paris",,,,"Voir la notice complète dans <a href=""http://www.calames.abes.fr/pub/obs.aspx"" target=""_blank"">Calames</a>",,,,,,,,,,,,,,,,,,,,,,,"17e siècle",,,,,,,,,,,,,,,,,,,,,,,,,,,,,,,,,,,,,,,,,,,,,,,,,,,,,,,,,,,,,,,,,,,,,"https://bibnum.obspm.fr/files/original/f22dbd082290ac5478e109c73047f13a.jpg,https://bibnum.obspm.fr/files/original/bc38d4151bc793c99c528f77f0582620.jpg",Texte,"C1/12 - Correspondance de Johannes Hevelius, volume 12 [1675-1678]",1,0
"Texte manuscrit de Gottfried Kirch, 15 octobre 1678",,"Kirch, Gottfried (1639-1710)",,,,,,,,Manuscrit,up-FR75114302-I018091,"Bibliothèque de l'Observatoire de Paris, C1/12-114",1678-10-15,,"C1/1-16 Correspondance de Johannes Hevelius",,,,,"Bibliothèque de l'Observatoire de Paris",,,,"Voir la notice complète dans <a href=""http://www.calames.abes.fr/pub/obs.aspx"" target=""_blank"">Calames</a>",,,,,,,,,,,,,,,,,,,,,,,"17e siècle",,,,,,,,,,,,,,,,,,,,,,,,,,,,,,,,,,,,,,,,,,,,,,,,,,,,,,,,,,,,,,,,,,,,,"https://bibnum.obspm.fr/files/original/6b8894318e7999ef572b27315e09e0bc.jpg,https://bibnum.obspm.fr/files/original/ba7f3b82e33cfb5378d1b6e0fc71ce7f.jpg",Texte,"C1/12 - Correspondance de Johannes Hevelius, volume 12 [1675-1678]",1,0
"Texte manuscrit de Gottfried Kirch, 15 octobre 1678",,"Kirch, Gottfried (1639-1710)",,,,,,,,Manuscrit,up-FR75114302-I018081,"Bibliothèque de l'Observatoire de Paris, C1/12-113",1678-10-15,,"C1/1-16 Correspondance de Johannes Hevelius",,,,,"Bibliothèque de l'Observatoire de Paris",,,,"Voir la notice complète dans <a href=""http://www.calames.abes.fr/pub/obs.aspx"" target=""_blank"">Calames</a>",,,,,,,,,,,,,,,,,,,,,,,"17e siècle",,,,,,,,,,,,,,,,,,,,,,,,,,,,,,,,,,,,,,,,,,,,,,,,,,,,,,,,,,,,,,,,,,,,,"https://bibnum.obspm.fr/files/original/539e81fd72d7b6b0c544463d76d543a8.jpg,https://bibnum.obspm.fr/files/original/4cc0a80199cae99db0cee601445a0f0a.jpg",Texte,"C1/12 - Correspondance de Johannes Hevelius, volume 12 [1675-1678]",1,0
"Lettre de Gottfried Kirch à Jan Heweliusz, Leipzig, 12 janvier 1678",,"Kirch, Gottfried (1639-1710)",,,,"Heweliusz, Jan (1611-1687)",,,,Manuscrit,up-FR75114302-I018761,"Bibliothèque de l'Observatoire de Paris, C1/13-24",1678-01-12,,"C1/1-16 Correspondance de Johannes Hevelius",,,,,"Bibliothèque de l'Observatoire de Paris",,,,"Voir la notice complète dans <a href=""http://www.calames.abes.fr/pub/obs.aspx"" target=""_blank"">Calames</a>",,,,,,,,,,,,,,,,,,,,,,,"17e siècle",,,,,,,,,,,,,,,,,,,,,,,,,,,,,,,,,,,,,,,,,,,,,,,,,,,,,,,,,,,,,,,,,,,,,"https://bibnum.obspm.fr/files/original/34664ea256c18a9d4be2e9475d288b9f.jpg,https://bibnum.obspm.fr/files/original/2abda58af5be6718fadf92682664cf28.jpg",Texte,"C1/13 - Correspondance de Johannes Hevelius, volume 13 [1677-1679]",1,0
"Lettre de Gottfried Kirch à Jan Heweliusz, Leipzig, 1er novembre 1678",,"Kirch, Gottfried (1639-1710)",,,,"Heweliusz, Jan (1611-1687)",,,,Manuscrit,up-FR75114302-I018591,"Bibliothèque de l'Observatoire de Paris, C1/13-7",1678-11-01,,"C1/1-16 Correspondance de Johannes Hevelius",,,,,"Bibliothèque de l'Observatoire de Paris",,,,"Voir la notice complète dans <a href=""http://www.calames.abes.fr/pub/obs.aspx"" target=""_blank"">Calames</a>",,,,,,,,,,,,,,,,,,,,,,,"17e siècle",,,,,,,,,,,,,,,,,,,,,,,,,,,,,,,,,,,,,,,,,,,,,,,,,,,,,,,,,,,,,,,,,,,,,"https://bibnum.obspm.fr/files/original/330fa0bfe62191459494e94ec621d3fa.jpg,https://bibnum.obspm.fr/files/original/241db6c8be73f56a1769b62912cf1b55.jpg",Texte,"C1/13 - Correspondance de Johannes Hevelius, volume 13 [1677-1679]",1,0
"Texte manuscrit de Gottfried Kirch, Leipzig, 1er novembre 1678",,"Kirch, Gottfried (1639-1710)",,,,,,,,Manuscrit,up-FR75114302-I018581,"Bibliothèque de l'Observatoire de Paris, C1/13-6",1678-11-01,,"C1/1-16 Correspondance de Johannes Hevelius",,,,,"Bibliothèque de l'Observatoire de Paris",,,,"Voir la notice complète dans <a href=""http://www.calames.abes.fr/pub/obs.aspx"" target=""_blank"">Calames</a>",,,,,,,,,,,,,,,,,,,,,,,"17e siècle",,,,,,,,,,,,,,,,,,,,,,,,,,,,,,,,,,,,,,,,,,,,,,,,,,,,,,,,,,,,,,,,,,,,,"https://bibnum.obspm.fr/files/original/8b27dbada1dcc202d40f05c25ffd78c0.jpg,https://bibnum.obspm.fr/files/original/333bcbf68781c6980a4030919dbc6fdc.jpg",Texte,"C1/13 - Correspondance de Johannes Hevelius, volume 13 [1677-1679]",1,0
"Texte manuscrit de Gottfried Kirch à Jan Heweliusz, Leipzig, 1678",,"Kirch, Gottfried (1639-1710)",,,,"Heweliusz, Jan (1611-1687)",,,,Manuscrit,up-FR75114302-I018571,"Bibliothèque de l'Observatoire de Paris, C1/13-5",1678-01-01/1678-12-31,,"C1/1-16 Correspondance de Johannes Hevelius",,,,,"Bibliothèque de l'Observatoire de Paris",,,,"Voir la notice complète dans <a href=""http://www.calames.abes.fr/pub/obs.aspx"" target=""_blank"">Calames</a>",,,,,,,,,,,,,,,,,,,,,,,"17e siècle",,,,,,,,,,,,,,,,,,,,,,,,,,,,,,,,,,,,,,,,,,,,,,,,,,,,,,,,,,,,,,,,,,,,,"https://bibnum.obspm.fr/files/original/b4f4379bc0a6d42995756dd635d4c827.jpg,https://bibnum.obspm.fr/files/original/68fc5fe4030c74d0e36a690ad21658e8.jpg,https://bibnum.obspm.fr/files/original/d0d0f73fd513dcfd50e7eaa0f37549f9.jpg,https://bibnum.obspm.fr/files/original/3a84d4f321855bb5b6fbe00aac056d80.jpg",Texte,"C1/13 - Correspondance de Johannes Hevelius, volume 13 [1677-1679]",1,0
"Lettre de Gottfried Kirch à Jan Heweliusz, Leipzig, 10 janvier 1683",,"Kirch, Gottfried (1639-1710)",,,,"Heweliusz, Jan (1611-1687)",,,,Manuscrit,up-FR75114302-I022921,"Bibliothèque de l'Observatoire de Paris, C1/15-128",1683-01-10,,"C1/1-16 Correspondance de Johannes Hevelius",,,,,"Bibliothèque de l'Observatoire de Paris",,,,"Voir la notice complète dans <a href=""http://www.calames.abes.fr/pub/obs.aspx"" target=""_blank"">Calames</a>",,,,,,,,,,,,,,,,,,,,,,,"17e siècle",,,,,,,,,,,,,,,,,,,,,,,,,,,,,,,,,,,,,,,,,,,,,,,,,,,,,,,,,,,,,,,,,,,,,"https://bibnum.obspm.fr/files/original/2893d79300b37c5e6a77c8c13ac7ed5f.jpg,https://bibnum.obspm.fr/files/original/971ae169e693a7c4d7cb0befc970ba3b.jpg",Texte,"C1/15 - Correspondance de Johannes Hevelius, volume 15 [1680-1683]",1,0
"Lettre de Gottfried Kirch à Jan Heweliusz, Leipzig, 5 mai 1683",,"Kirch, Gottfried (1639-1710)",,,,"Heweliusz, Jan (1611-1687)",,,,Manuscrit,up-FR75114302-I022881,"Bibliothèque de l'Observatoire de Paris, C1/15-124",1683-05-05,,"C1/1-16 Correspondance de Johannes Hevelius",,,,,"Bibliothèque de l'Observatoire de Paris",,,,"Voir la notice complète dans <a href=""http://www.calames.abes.fr/pub/obs.aspx"" target=""_blank"">Calames</a>",,,,,,,,,,,,,,,,,,,,,,,"17e siècle",,,,,,,,,,,,,,,,,,,,,,,,,,,,,,,,,,,,,,,,,,,,,,,,,,,,,,,,,,,,,,,,,,,,,"https://bibnum.obspm.fr/files/original/a5d20ebed6489668b5d6ef4d80449953.jpg,https://bibnum.obspm.fr/files/original/fa86775806a315bd0fb40199c1303fce.jpg,https://bibnum.obspm.fr/files/original/684ec217a94336d56c5afdcdf9d347b3.jpg,https://bibnum.obspm.fr/files/original/d93165108a50d8426a869b76291b6dea.jpg",Texte,"C1/15 - Correspondance de Johannes Hevelius, volume 15 [1680-1683]",1,0
"Lettre de Gottfried Kirch à Jan Heweliusz, Leipzig, 9 septembre 1682",,"Kirch, Gottfried (1639-1710)",,,,"Heweliusz, Jan (1611-1687)",,,,Manuscrit,up-FR75114302-I022571,"Bibliothèque de l'Observatoire de Paris, C1/15-93",1682-09-09,,"C1/1-16 Correspondance de Johannes Hevelius",,,,,"Bibliothèque de l'Observatoire de Paris",,,,"Voir la notice complète dans <a href=""http://www.calames.abes.fr/pub/obs.aspx"" target=""_blank"">Calames</a>",,,,,,,,,,,,,,,,,,,,,,,"17e siècle",,,,,,,,,,,,,,,,,,,,,,,,,,,,,,,,,,,,,,,,,,,,,,,,,,,,,,,,,,,,,,,,,,,,,"https://bibnum.obspm.fr/files/original/428f7512307e90703de655afda7359cf.jpg,https://bibnum.obspm.fr/files/original/a07c2edc960f07fe388ee57ec922b8ff.jpg",Texte,"C1/15 - Correspondance de Johannes Hevelius, volume 15 [1680-1683]",1,0
"Lettre de Gottfried Kirch à Jan Heweliusz, Leipzig, 30 août 1682",,"Kirch, Gottfried (1639-1710)",,,,"Heweliusz, Jan (1611-1687)",,,,Manuscrit,up-FR75114302-I022561,"Bibliothèque de l'Observatoire de Paris, C1/15-92",1682-08-30,,"C1/1-16 Correspondance de Johannes Hevelius",,,,,"Bibliothèque de l'Observatoire de Paris",,,,"Voir la notice complète dans <a href=""http://www.calames.abes.fr/pub/obs.aspx"" target=""_blank"">Calames</a>",,,,,,,,,,,,,,,,,,,,,,,"17e siècle",,,,,,,,,,,,,,,,,,,,,,,,,,,,,,,,,,,,,,,,,,,,,,,,,,,,,,,,,,,,,,,,,,,,,"https://bibnum.obspm.fr/files/original/a47e72026514417f2f04bbf61e34f2b3.jpg,https://bibnum.obspm.fr/files/original/900e483098fec966cacaeb67eb667d0c.jpg,https://bibnum.obspm.fr/files/original/2f9393782a50dcacd939168cf8d1f1c9.jpg,https://bibnum.obspm.fr/files/original/97b531a4eb392244c1b9b978a7568d94.jpg",Texte,"C1/15 - Correspondance de Johannes Hevelius, volume 15 [1680-1683]",1,0
"Lettre de Gottfried Kirch à Jan Heweliusz, Leipzig, 6 juillet 1682",,"Kirch, Gottfried (1639-1710)",,,,"Heweliusz, Jan (1611-1687)",,,,Manuscrit,up-FR75114302-I022551,"Bibliothèque de l'Observatoire de Paris, C1/15-91",1682-07-06,,"C1/1-16 Correspondance de Johannes Hevelius",,,,,"Bibliothèque de l'Observatoire de Paris",,,,"Voir la notice complète dans <a href=""http://www.calames.abes.fr/pub/obs.aspx"" target=""_blank"">Calames</a>",,,,,,,,,,,,,,,,,,,,,,,"17e siècle",,,,,,,,,,,,,,,,,,,,,,,,,,,,,,,,,,,,,,,,,,,,,,,,,,,,,,,,,,,,,,,,,,,,,"https://bibnum.obspm.fr/files/original/676b604e42491943edf6e64965a025ed.jpg,https://bibnum.obspm.fr/files/original/94058a8750cf5f4868942eb1a4c31de0.jpg,https://bibnum.obspm.fr/files/original/4eeb1ac2970fbf630458c6d2cac024ae.jpg,https://bibnum.obspm.fr/files/original/80ceb406df85b25d91c363a482d7f333.jpg,https://bibnum.obspm.fr/files/original/667008fb40d1d84ebca871f936e20312.jpg,https://bibnum.obspm.fr/files/original/315ec22f08f341e0cce9ca50464b7f77.jpg,https://bibnum.obspm.fr/files/original/cdcd8836da4d5821fad4b390b8705c6d.jpg,https://bibnum.obspm.fr/files/original/214fd2be883c7cf1e8c9b5794d4801ca.jpg",Texte,"C1/15 - Correspondance de Johannes Hevelius, volume 15 [1680-1683]",1,0
"Lettre de Gottfried Kirch à Jan Heweliusz, Leipzig, 14 mai 1682",,"Kirch, Gottfried (1639-1710)",,,,"Heweliusz, Jan (1611-1687)",,,,Manuscrit,up-FR75114302-I022421,"Bibliothèque de l'Observatoire de Paris, C1/15-78",1682-05-14,,"C1/1-16 Correspondance de Johannes Hevelius",,,,,"Bibliothèque de l'Observatoire de Paris",,,,"Voir la notice complète dans <a href=""http://www.calames.abes.fr/pub/obs.aspx"" target=""_blank"">Calames</a>",,,,,,,,,,,,,,,,,,,,,,,"17e siècle",,,,,,,,,,,,,,,,,,,,,,,,,,,,,,,,,,,,,,,,,,,,,,,,,,,,,,,,,,,,,,,,,,,,,"https://bibnum.obspm.fr/files/original/df01dc1e2bfd52696d2d7a80f9b04c5e.jpg,https://bibnum.obspm.fr/files/original/c827cd65a19f3a8705a6ac622a9683bd.jpg",Texte,"C1/15 - Correspondance de Johannes Hevelius, volume 15 [1680-1683]",1,0
"Lettre de Gottfried Kirch à Jan Heweliusz, Leipzig, 9 janvier 1682",,"Kirch, Gottfried (1639-1710)",,,,"Heweliusz, Jan (1611-1687)",,,,Manuscrit,up-FR75114302-I022341,"Bibliothèque de l'Observatoire de Paris, C1/15-70",1682-01-09,,"C1/1-16 Correspondance de Johannes Hevelius",,,,,"Bibliothèque de l'Observatoire de Paris",,,,"Voir la notice complète dans <a href=""http://www.calames.abes.fr/pub/obs.aspx"" target=""_blank"">Calames</a>",,,,,,,,,,,,,,,,,,,,,,,"17e siècle",,,,,,,,,,,,,,,,,,,,,,,,,,,,,,,,,,,,,,,,,,,,,,,,,,,,,,,,,,,,,,,,,,,,,"https://bibnum.obspm.fr/files/original/cb78f6f66f3405e67cc0373281f0cffa.jpg,https://bibnum.obspm.fr/files/original/e51b35c0bc82a15780ccd773d40c59f9.jpg",Texte,"C1/15 - Correspondance de Johannes Hevelius, volume 15 [1680-1683]",1,0
"Lettre de Gottfried Kirch à Jan Heweliusz, Leipzig, 17 décembre 1681",,"Kirch, Gottfried (1639-1710)",,,,"Heweliusz, Jan (1611-1687)",,,,Manuscrit,up-FR75114302-I022061,"Bibliothèque de l'Observatoire de Paris, C1/15-42",1681-12-17,,"C1/1-16 Correspondance de Johannes Hevelius",,,,,"Bibliothèque de l'Observatoire de Paris",,,,"Voir la notice complète dans <a href=""http://www.calames.abes.fr/pub/obs.aspx"" target=""_blank"">Calames</a>",,,,,,,,,,,,,,,,,,,,,,,"17e siècle",,,,,,,,,,,,,,,,,,,,,,,,,,,,,,,,,,,,,,,,,,,,,,,,,,,,,,,,,,,,,,,,,,,,,"https://bibnum.obspm.fr/files/original/a616eaa0c30b1f5daab8a94ad965be4b.jpg,https://bibnum.obspm.fr/files/original/c71fe08840c8ee15351b03b958cced97.jpg,https://bibnum.obspm.fr/files/original/98a7a30f4512173e52ebab98f5cebdfa.jpg,https://bibnum.obspm.fr/files/original/12c82adcb9c604fd5c0dcc3dc5225257.jpg",Texte,"C1/15 - Correspondance de Johannes Hevelius, volume 15 [1680-1683]",1,0
"Lettre de Gottfried Kirch à Jan Heweliusz, Leipzig, 17 août 1681",,"Kirch, Gottfried (1639-1710)",,,,"Heweliusz, Jan (1611-1687)",,,,Manuscrit,up-FR75114302-I021941,"Bibliothèque de l'Observatoire de Paris, C1/15-30",1681-08-17,,"C1/1-16 Correspondance de Johannes Hevelius",,,,,"Bibliothèque de l'Observatoire de Paris",,,,"Voir la notice complète dans <a href=""http://www.calames.abes.fr/pub/obs.aspx"" target=""_blank"">Calames</a>",,,,,,,,,,,,,,,,,,,,,,,"17e siècle",,,,,,,,,,,,,,,,,,,,,,,,,,,,,,,,,,,,,,,,,,,,,,,,,,,,,,,,,,,,,,,,,,,,,"https://bibnum.obspm.fr/files/original/c87fc17e5eed47d4cbc496210a50444b.jpg,https://bibnum.obspm.fr/files/original/b30927343879a47583a4bb204c9bdf2b.jpg,https://bibnum.obspm.fr/files/original/85397b64906cfc688af6c7a58297829b.jpg,https://bibnum.obspm.fr/files/original/14ec601c0486d8a2b4d23d686339b533.jpg,https://bibnum.obspm.fr/files/original/e9e6e60f417896ee1d6b2dbd3071f2ee.jpg,https://bibnum.obspm.fr/files/original/834f7be2db5d565a5da7697164ac6f31.jpg",Texte,"C1/15 - Correspondance de Johannes Hevelius, volume 15 [1680-1683]",1,0
"Lettre de Gottfried Kirch à Jan Heweliusz, Cobourg, 14 avril 1681",,"Kirch, Gottfried (1639-1710)",,,,"Heweliusz, Jan (1611-1687)",,,,Manuscrit,up-FR75114302-I021681,"Bibliothèque de l'Observatoire de Paris, C1/15-4",1681-04-14,,"C1/1-16 Correspondance de Johannes Hevelius",,,,,"Bibliothèque de l'Observatoire de Paris",,,,"Voir la notice complète dans <a href=""http://www.calames.abes.fr/pub/obs.aspx"" target=""_blank"">Calames</a>",,,,,,,,,,,,,,,,,,,,,,,"17e siècle",,,,,,,,,,,,,,,,,,,,,,,,,,,,,,,,,,,,,,,,,,,,,,,,,,,,,,,,,,,,,,,,,,,,,"https://bibnum.obspm.fr/files/original/cad7796a384f9179de5a52f86bf5f6f2.jpg,https://bibnum.obspm.fr/files/original/e8fdeaeeb98b6f8ff1457777b953a31e.jpg",Texte,"C1/15 - Correspondance de Johannes Hevelius, volume 15 [1680-1683]",1,0
"Lettre de Gottfried Kirch à Jan Heweliusz, Leipzig, 5 juillet 1684",,"Kirch, Gottfried (1639-1710)",,,,"Heweliusz, Jan (1611-1687)",,,,Manuscrit,up-FR75114302-I024471,"Bibliothèque de l'Observatoire de Paris, C1/16-126",1684-07-05,,"C1/1-16 Correspondance de Johannes Hevelius",,,,,"Bibliothèque de l'Observatoire de Paris",,,,"Voir la notice complète dans <a href=""http://www.calames.abes.fr/pub/obs.aspx"" target=""_blank"">Calames</a>",,,,,,,,,,,,,,,,,,,,,,,"17e siècle",,,,,,,,,,,,,,,,,,,,,,,,,,,,,,,,,,,,,,,,,,,,,,,,,,,,,,,,,,,,,,,,,,,,,"https://bibnum.obspm.fr/files/original/a3f3a2c301dcd38451a1a39f924fa77e.jpg,https://bibnum.obspm.fr/files/original/200d7164122c0fef03e77d63170b7f71.jpg",Texte,"C1/16 - Correspondance de Johannes Hevelius, volume 16 [1662-1686]",1,0
"Lettre de Gottfried Kirch à Jan Heweliusz, Leipzig, 26 avril 1684",,"Kirch, Gottfried (1639-1710)",,,,"Heweliusz, Jan (1611-1687)",,,,Manuscrit,up-FR75114302-I024431,"Bibliothèque de l'Observatoire de Paris, C1/16-122",1684-04-26,,"C1/1-16 Correspondance de Johannes Hevelius",,,,,"Bibliothèque de l'Observatoire de Paris",,,,"Voir la notice complète dans <a href=""http://www.calames.abes.fr/pub/obs.aspx"" target=""_blank"">Calames</a>",,,,,,,,,,,,,,,,,,,,,,,"17e siècle",,,,,,,,,,,,,,,,,,,,,,,,,,,,,,,,,,,,,,,,,,,,,,,,,,,,,,,,,,,,,,,,,,,,,"https://bibnum.obspm.fr/files/original/f03e5fa0ca70e3252c369aca82093961.jpg,https://bibnum.obspm.fr/files/original/adf44e9af1a3d9f2512134798011d0fe.jpg",Texte,"C1/16 - Correspondance de Johannes Hevelius, volume 16 [1662-1686]",1,0
"Lettre de Gottfried Kirch à Jan Heweliusz, Leipzig, 29 mars 1684",,"Kirch, Gottfried (1639-1710)",,,,"Heweliusz, Jan (1611-1687)",,,,Manuscrit,up-FR75114302-I023851,"Bibliothèque de l'Observatoire de Paris, C1/16-64",1684-03-29,,"C1/1-16 Correspondance de Johannes Hevelius",,,,,"Bibliothèque de l'Observatoire de Paris",,,,"Voir la notice complète dans <a href=""http://www.calames.abes.fr/pub/obs.aspx"" target=""_blank"">Calames</a>",,,,,,,,,,,,,,,,,,,,,,,"17e siècle",,,,,,,,,,,,,,,,,,,,,,,,,,,,,,,,,,,,,,,,,,,,,,,,,,,,,,,,,,,,,,,,,,,,,"https://bibnum.obspm.fr/files/original/5675ccdcee0f6ec39c47473c8835c44a.jpg,https://bibnum.obspm.fr/files/original/0a7da233507b48b95548b70b72c29f00.jpg",Texte,"C1/16 - Correspondance de Johannes Hevelius, volume 16 [1662-1686]",1,0
"Texte manuscrit de Gottfried Kirch, Leipzig, 24 janvier 1684",,"Kirch, Gottfried (1639-1710)",,,,,,,,Manuscrit,up-FR75114302-I023501,"Bibliothèque de l'Observatoire de Paris, C1/16-29",1684-01-24,,"C1/1-16 Correspondance de Johannes Hevelius",,,,,"Bibliothèque de l'Observatoire de Paris",,,,"Voir la notice complète dans <a href=""http://www.calames.abes.fr/pub/obs.aspx"" target=""_blank"">Calames</a>",,,,,,,,,,,,,,,,,,,,,,,"17e siècle",,,,,,,,,,,,,,,,,,,,,,,,,,,,,,,,,,,,,,,,,,,,,,,,,,,,,,,,,,,,,,,,,,,,,"https://bibnum.obspm.fr/files/original/6cbe389ec919765c3e17046a4134e1e0.jpg,https://bibnum.obspm.fr/files/original/08a6666181debebc6b8fd2637126776a.jpg,https://bibnum.obspm.fr/files/original/20279fc38bc04483bf57f6473a3bb836.jpg",Texte,"C1/16 - Correspondance de Johannes Hevelius, volume 16 [1662-1686]",1,0
"Lettre de Gottfried Kirch à Jan Heweliusz, Leipzig, 26 janvier 1684",,"Kirch, Gottfried (1639-1710)",,,,"Heweliusz, Jan (1611-1687)",,,,Manuscrit,up-FR75114302-I023491,"Bibliothèque de l'Observatoire de Paris, C1/16-28",1684-01-26,,"C1/1-16 Correspondance de Johannes Hevelius",,,,,"Bibliothèque de l'Observatoire de Paris",,,,"Voir la notice complète dans <a href=""http://www.calames.abes.fr/pub/obs.aspx"" target=""_blank"">Calames</a>",,,,,,,,,,,,,,,,,,,,,,,"17e siècle",,,,,,,,,,,,,,,,,,,,,,,,,,,,,,,,,,,,,,,,,,,,,,,,,,,,,,,,,,,,,,,,,,,,,"https://bibnum.obspm.fr/files/original/a3b1569f24a0c656bbc2df7aa8b65eb9.jpg,https://bibnum.obspm.fr/files/original/a507613bcc5b6d9db659faf3458c7179.jpg",Texte,"C1/16 - Correspondance de Johannes Hevelius, volume 16 [1662-1686]",1,0
"Lettre de Gottfried Kirch à Jan Heweliusz, Leipzig, 4 janvier 1684",,"Kirch, Gottfried (1639-1710)",,,,"Heweliusz, Jan (1611-1687)",,,,Manuscrit,up-FR75114302-I023481,"Bibliothèque de l'Observatoire de Paris, C1/16-27",1684-01-04,,"C1/1-16 Correspondance de Johannes Hevelius",,,,,"Bibliothèque de l'Observatoire de Paris",,,,"Voir la notice complète dans <a href=""http://www.calames.abes.fr/pub/obs.aspx"" target=""_blank"">Calames</a>",,,,,,,,,,,,,,,,,,,,,,,"17e siècle",,,,,,,,,,,,,,,,,,,,,,,,,,,,,,,,,,,,,,,,,,,,,,,,,,,,,,,,,,,,,,,,,,,,,"https://bibnum.obspm.fr/files/original/98622c3e1ec53ffadaa9c2c77118b23f.jpg,https://bibnum.obspm.fr/files/original/10579490f5f0e38d7640f185e77c70b8.jpg,https://bibnum.obspm.fr/files/original/09ede3ec138fb6e5bf1534cc0cd422e5.jpg,https://bibnum.obspm.fr/files/original/6497fb961e6a3906f9a8f3a9998fb1db.jpg",Texte,"C1/16 - Correspondance de Johannes Hevelius, volume 16 [1662-1686]",1,0