﻿"Dublin Core:Title","Dublin Core:Titre alternatif","Dublin Core:Creator","Dublin Core:Subject","Dublin Core:Description","Dublin Core:Publisher","Dublin Core:Contributor","Dublin Core:Format","Dublin Core:Extent","Dublin Core:Medium","Dublin Core:Type","Dublin Core:Identifier","Dublin Core:Source","Dublin Core:Date","Dublin Core:Language","Dublin Core:Is Part Of","Dublin Core:Has Version","Dublin Core:Coverage","Dublin Core:Provenance","Dublin Core:Rights Holder","Dublin Core:Rights","Dublin Core:Abstract","Dublin Core:Table Of Contents","Dublin Core:Date Available","Dublin Core:Relation","Dublin Core:Date Accepted","Dublin Core:Date Copyrighted","Dublin Core:Date Submitted","Dublin Core:Date Created","Dublin Core:Date Issued","Dublin Core:Date Modified","Dublin Core:Date Valid","Dublin Core:Access Rights","Dublin Core:License","Dublin Core:Conforms To","Dublin Core:Has Format","Dublin Core:Has Part","Dublin Core:Is Format Of","Dublin Core:Is Referenced By","Dublin Core:Is Replaced By","Dublin Core:Is Required By","Dublin Core:Is Version Of","Dublin Core:References","Dublin Core:Replaces","Dublin Core:Requires","Dublin Core:Bibliographic Citation","Dublin Core:Spatial Coverage","Dublin Core:Temporal Coverage","Dublin Core:Accrual Method","Dublin Core:Accrual Periodicity","Dublin Core:Accrual Policy","Dublin Core:Audience","Dublin Core:Audience Education Level","Dublin Core:Mediator","Dublin Core:Instructional Method","Item Type Metadata:Text","Item Type Metadata:Interviewer","Item Type Metadata:Interviewee","Item Type Metadata:Location","Item Type Metadata:Transcription","Item Type Metadata:Local URL","Item Type Metadata:Original Format","Item Type Metadata:Physical Dimensions","Item Type Metadata:Duration","Item Type Metadata:Compression","Item Type Metadata:Producer","Item Type Metadata:Director","Item Type Metadata:Bit Rate/Frequency","Item Type Metadata:Time Summary","Item Type Metadata:Email Body","Item Type Metadata:Subject Line","Item Type Metadata:From","Item Type Metadata:To","Item Type Metadata:CC","Item Type Metadata:BCC","Item Type Metadata:Number of Attachments","Item Type Metadata:Standards","Item Type Metadata:Objectives","Item Type Metadata:Materials","Item Type Metadata:Lesson Plan Text","Item Type Metadata:URL","Item Type Metadata:Event Type","Item Type Metadata:Participants","Item Type Metadata:Birth Date","Item Type Metadata:Birthplace","Item Type Metadata:Death Date","Item Type Metadata:Occupation","Item Type Metadata:Biographical Text","Item Type Metadata:Bibliography","Item Type Metadata:Edition Statement","Item Type Metadata:Publication Statement","Item Type Metadata:Note statement","Item Type Metadata:Profile description : Creation","Item Type Metadata:Profile description : Descriptive Rules","Item Type Metadata:Profile description : Language Usage","Item Type Metadata:Revision Description : Change","Item Type Metadata:Revision Description : List","Item Type Metadata:Front matter : Title page","Item Type Metadata:Front matter : Division","Item Type Metadata:Player","Visiteur Elements:Dites des choses","PDF Text:Text","EAD Archive:Descriptive Identification : Heading","EAD Archive:Descriptive Identification : Note","EAD Archive:Appraisal Information","EAD Archive:Arrangement","EAD Archive:Biography or History","EAD Archive:Index","EAD Archive:Level","EAD Archive:Note","EAD Archive:Other Descriptive Data","EAD Archive:Processing Information","EAD Archive:Scope and Content","EAD Archive:Heading","EAD Archive:Table Head",tags,file,itemType,collection,public,featured
"Sur les éclipses des satellites observées par le P. Laval en 1710 à Marseille.",,,,,,"Laval, Antoine-François (1664-1728)",,,,Manuscrit,up-FR751142302-M015011,"Bibliothèque de l'Observatoire de Paris, B4/1 (74)",1710,,"B4/1 - Observations astronomiques... - Traités et dissertations de divers auteurs. — Mémoires de J. Dom. Cassini sur la physique et l'astronomie",,,,,"Bibliothèque de l'Observatoire de Paris",,,,"Voir la notice complète dans <a href=""http://www.calames.abes.fr/pub/obs.aspx"" target=""_blank"">Calames</a>",,,,,,,,,,,,,,,,,,,,,,,"18e siècle",,,,,,,,,,,,,,,,,,,,,,,,,,,,,,,,,,,,,,,,,,,,,,,,,,,,,,,,,,,,,,,,,,,,,"https://bibnum.obspm.fr/files/original/27e5c303ab11cf555b999c2b90209bb9.jpg,https://bibnum.obspm.fr/files/original/ae04569ae3ed45f9a358602246efc066.jpg,https://bibnum.obspm.fr/files/original/03cec936fa80a27f78fba46e229a3240.jpg,https://bibnum.obspm.fr/files/original/9a5bfa4f7b24a8d6b317a2a6d8d872ff.jpg",Texte,"B4/1 - Observations astronomiques... - Traités et dissertations de divers auteurs. — Mémoires de J. Dom. Cassini sur la physique et l'astronomie (1607-1761)",1,0
"CASSINI I. Réflexions sur les observations envoyées à M. le C. Pontch. par le Père Laval p. r. d'hydrographie",,"Cassini, Jean-Dominique (1625-1712)",,,,"Laval, Antoine-François (1664-1728)",,,,Manuscrit,up-FR751142302-M016051,"Bibliothèque de l'Observatoire de Paris, B4/3 (60)",1706,,"B4/3 - Abrégé et analyse de 128 (mémoires) de J.-Dom. Cassini répandus dans les volumes de l'Académie royale des Sciences ; — Catalogue complet de ses ouvrages par César-François Cassini III. — Récit de la visite du Roi d'Angleterre à l'Observatoire royal de Paris",,,,,"Bibliothèque de l'Observatoire de Paris",,,,"Voir la notice complète dans <a href=""http://www.calames.abes.fr/pub/obs.aspx"" target=""_blank"">Calames</a>",,,,,,,,,,,,,,,,,,,,,,,"18e siècle",,,,,,,,,,,,,,,,,,,,,,,,,,,,,,,,,,,,,,,,,,,,,,,,,,,,,,,,,,,,,,,,,,,,,"https://bibnum.obspm.fr/files/original/55bddea990c7d51968e6ff501b143643.jpg,https://bibnum.obspm.fr/files/original/30cfbca9eae1c0d4af9554371f7be5d7.jpg,https://bibnum.obspm.fr/files/original/af9a870485433d8716d8d3cec3a54980.jpg,https://bibnum.obspm.fr/files/original/141090520c28be9a4e3b855c491bd19c.jpg",Texte,"B4/3 - Abrégé et analyse de 128 (mémoires) de J.-Dom. Cassini répandus dans les volumes de l'Académie royale des Sciences ; — Catalogue complet de ses ouvrages par César-François Cassini III. — Récit de la visite du Roi d'Angleterre à l'Observatoire royal de Paris (1667-1712)",1,0
"Conjonction de Mars avec la luisance qui est dans le front du Scorpion tirée des observations du Père Laval jésuite faites à Marseille le 3 février 1702",,,,,,"Laval, Antoine-François (1664-1728)",,,,Manuscrit,up-FR751142302-M017331,"Bibliothèque de l'Observatoire de Paris, B4/4 (45)",1702-02-03,,"B4/4 - Cassini (Jacques) dit Cassini II, Mémoires sur différents points d'astronomie…",,,,,"Bibliothèque de l'Observatoire de Paris",,,,"Voir la notice complète dans <a href=""http://www.calames.abes.fr/pub/obs.aspx"" target=""_blank"">Calames</a>",,,,,,,,,,,,,,,,,,,,,,,"18e siècle",,,,,,,,,,,,,,,,,,,,,,,,,,,,,,,,,,,,,,,,,,,,,,,,,,,,,,,,,,,,,,,,,,,,,"https://bibnum.obspm.fr/files/original/914e1517b761251fcddd2cd69c3423e8.jpg,https://bibnum.obspm.fr/files/original/640ca30dd76c86bac6a1667c47c05cc3.jpg",Texte,"B4/4 - Cassini (Jacques) dit Cassini II, Mémoires sur différents points d'astronomie... (1683-1762)",1,0
"Lettre de Joseph-Nicolas Delisle à Antoine-François Laval, Paris, 7 février 1724",,"Delisle, Joseph-Nicolas (1688-1768)",,,,"Laval, Antoine-François (1664-1728)",,,,Manuscrit,up-FR751142302-E002741,"Bibliothèque de l'Observatoire de Paris, B1/2-85",1724-02-07,,"B1/1-8 Correspondance de Joseph-Nicolas Delisle",,,,,"Bibliothèque de l'Observatoire de Paris",,,,"Voir la notice complète dans <a href=""http://www.calames.abes.fr/pub/obs.aspx"" target=""_blank"">Calames</a>",,,,,,,,,,,,,,,,,,,,,,,"18e siècle",,,,,,,,,,,,,,,,,,,,,,,,,,,,,,,,,,,,,,,,,,,,,,,,,,,,,,,,,,,,,,,,,,,,,"https://bibnum.obspm.fr/files/original/ba8cd659d364626e4c2f1d8a710c69b2.jpg,https://bibnum.obspm.fr/files/original/7e726238590d05694d03d1c65ae353ed.jpg,https://bibnum.obspm.fr/files/original/4144d0e26e71077e37846d5563083b31.jpg,https://bibnum.obspm.fr/files/original/ab6d57499c83c8cda234a947b54da95d.jpg,https://bibnum.obspm.fr/files/original/2499d634e5f3085662a472bcee3aed2d.jpg,https://bibnum.obspm.fr/files/original/83bd4347cd45f2e459fccdfedd526879.jpg,https://bibnum.obspm.fr/files/original/ee33407c2c1970bed955cf8fb41da70b.jpg,https://bibnum.obspm.fr/files/original/11a4cd9f4a5b4728b37de235d5cbeaa1.jpg,https://bibnum.obspm.fr/files/original/aa50f4baf42dfbfa6e5070ee0b193cea.jpg,https://bibnum.obspm.fr/files/original/f61dfdbd0b0ad5547127f4aad881554e.jpg,https://bibnum.obspm.fr/files/original/cdca7305a2419fa18776e4256881bf22.jpg,https://bibnum.obspm.fr/files/original/af810934c49b52bc7984188245cc1dda.jpg",Texte,"B1/2 - [Lettres du 4 août 1721 à décembre 1725]",1,0
"Lettre de Joseph-Nicolas Delisle à Antoine-François Laval, Paris, 20 mars 1724",,"Delisle, Joseph-Nicolas (1688-1768)",,,,"Laval, Antoine-François (1664-1728)",,,,Manuscrit,up-FR751142302-E002831,"Bibliothèque de l'Observatoire de Paris, B1/2-94",1724-03-20,,"B1/1-8 Correspondance de Joseph-Nicolas Delisle",,,,,"Bibliothèque de l'Observatoire de Paris",,,,"Voir la notice complète dans <a href=""http://www.calames.abes.fr/pub/obs.aspx"" target=""_blank"">Calames</a>",,,,,,,,,,,,,,,,,,,,,,,"18e siècle",,,,,,,,,,,,,,,,,,,,,,,,,,,,,,,,,,,,,,,,,,,,,,,,,,,,,,,,,,,,,,,,,,,,,"https://bibnum.obspm.fr/files/original/071839e35749d71e0001bf103b165a69.jpg,https://bibnum.obspm.fr/files/original/490e509ba5164486e7126bbb5186e69d.jpg,https://bibnum.obspm.fr/files/original/b946fc91c429568a0c18e53962d30e96.jpg,https://bibnum.obspm.fr/files/original/1bf1defa27441b3055d6d4649100071c.jpg,https://bibnum.obspm.fr/files/original/343382a7012a08ed09e5ae58990008a6.jpg,https://bibnum.obspm.fr/files/original/cb6ec1fc27ac63215287e58487dc63a6.jpg",Texte,"B1/2 - [Lettres du 4 août 1721 à décembre 1725]",1,0
"Lettre de Joseph-Nicolas Delisle à Antoine-François Laval, Paris, 5 juin 1724",,"Delisle, Joseph-Nicolas (1688-1768)",,,,"Laval, Antoine-François (1664-1728)",,,,Manuscrit,up-FR751142302-E002951,"Bibliothèque de l'Observatoire de Paris, B1/2-108",1724-06-05,,"B1/1-8 Correspondance de Joseph-Nicolas Delisle",,,,,"Bibliothèque de l'Observatoire de Paris",,,,"Voir la notice complète dans <a href=""http://www.calames.abes.fr/pub/obs.aspx"" target=""_blank"">Calames</a>",,,,,,,,,,,,,,,,,,,,,,,"18e siècle",,,,,,,,,,,,,,,,,,,,,,,,,,,,,,,,,,,,,,,,,,,,,,,,,,,,,,,,,,,,,,,,,,,,,"https://bibnum.obspm.fr/files/original/92a7aca67f159cd29dd26d4a640bd830.jpg,https://bibnum.obspm.fr/files/original/dd2a06c149d1af6711dcdb37fa5442bc.jpg,https://bibnum.obspm.fr/files/original/0584fa169d0df0b07786d972e477545c.jpg,https://bibnum.obspm.fr/files/original/c8357d21c1f2875d687e908a62ffa17a.jpg,https://bibnum.obspm.fr/files/original/5393ebbb0fee2aa5091a5f6f6f59988c.jpg,https://bibnum.obspm.fr/files/original/3988c64cb665282e9de74a98b1c0b9ef.jpg",Texte,"B1/2 - [Lettres du 4 août 1721 à décembre 1725]",1,0
"Lettre de Joseph-Nicolas Delisle à Antoine-François Laval, Paris, 25 juin 1724",,"Delisle, Joseph-Nicolas (1688-1768)",,,,"Laval, Antoine-François (1664-1728)",,,,Manuscrit,up-FR751142302-E003041,"Bibliothèque de l'Observatoire de Paris, B1/2-119",1724-06-25,,"B1/1-8 Correspondance de Joseph-Nicolas Delisle",,,,,"Bibliothèque de l'Observatoire de Paris",,,,"Voir la notice complète dans <a href=""http://www.calames.abes.fr/pub/obs.aspx"" target=""_blank"">Calames</a>",,,,,,,,,,,,,,,,,,,,,,,"18e siècle",,,,,,,,,,,,,,,,,,,,,,,,,,,,,,,,,,,,,,,,,,,,,,,,,,,,,,,,,,,,,,,,,,,,,"https://bibnum.obspm.fr/files/original/7f22c2fe71271c274bee951b4c32fa6a.jpg,https://bibnum.obspm.fr/files/original/0451ef060de6aa1c2aa9113a659f56c8.jpg,https://bibnum.obspm.fr/files/original/ff71015ab36cccbdddd7c0553164d5b5.jpg,https://bibnum.obspm.fr/files/original/84dd081b49d89ac3151063d1d1326698.jpg",Texte,"B1/2 - [Lettres du 4 août 1721 à décembre 1725]",1,0
"Lettre de Joseph-Nicolas Delisle à Antoine-François Laval, Paris, 4 novembre 1725",,"Delisle, Joseph-Nicolas (1688-1768)",,,,"Laval, Antoine-François (1664-1728)",,,,Manuscrit,up-FR751142302-E003411,"Bibliothèque de l'Observatoire de Paris, B1/2-161",1725-11-04,,"B1/1-8 Correspondance de Joseph-Nicolas Delisle",,,,,"Bibliothèque de l'Observatoire de Paris",,,,"Voir la notice complète dans <a href=""http://www.calames.abes.fr/pub/obs.aspx"" target=""_blank"">Calames</a>",,,,,,,,,,,,,,,,,,,,,,,"18e siècle",,,,,,,,,,,,,,,,,,,,,,,,,,,,,,,,,,,,,,,,,,,,,,,,,,,,,,,,,,,,,,,,,,,,,"https://bibnum.obspm.fr/files/original/dbc8d2e7203e9a5aa495f73ef7efdcc4.jpg,https://bibnum.obspm.fr/files/original/c96a3ae4e01fa17744d52758205007bb.jpg,https://bibnum.obspm.fr/files/original/3131b4ed16d043b133e5f61475f54b93.jpg,https://bibnum.obspm.fr/files/original/c2521beecc86fbc3b38052c26237c500.jpg,https://bibnum.obspm.fr/files/original/fa90250c7dcd002c4c8c7ada8766fbe4.jpg,https://bibnum.obspm.fr/files/original/b083334edd754c9f51f7ffca67e86c20.jpg,https://bibnum.obspm.fr/files/original/d586e0861855e7978613de41278da667.jpg,https://bibnum.obspm.fr/files/original/9efee8725949aecbb77fa08e3960c8a0.jpg,https://bibnum.obspm.fr/files/original/bff839bfcc4e97931c07c88971ee6d78.jpg,https://bibnum.obspm.fr/files/original/fccc604a582c44c39100df8aa3b5510b.jpg",Texte,"B1/2 - [Lettres du 4 août 1721 à décembre 1725]",1,0
